program: Gaussian 09
title: 000014376
version: EM64L-G09RevD.01
frameworkgroup: C1[X(C13H17F2NO2)]
method: RPBEPBE
basis: SDD
operation: Freq
keyword: #p
keyword: freq=noraman
keyword: PBEPBE/SDD
title: #p freq=noraman PBEPBE/SDD
converged: YES YES NO NO
title: Mulliken charges:
elementType: F F O O N C C C C C C C C C C C C C H H H H H H H H H H H H H H H H H
charge: -0.245530 -0.245352 -0.415098 -0.232894 -0.167584 0.465127 -0.458104 -0.456175 0.548708 -0.601770 -0.569820 -0.391117 -0.438105 -0.489090 -0.241722 -0.190492 -0.190033 0.186155 0.223447 0.282460 0.280149 0.221174 0.226127 0.229540 0.230220 0.221724 0.234622 0.264570 0.267444 0.218722 0.225138 0.203145 0.226083 0.202179 0.376151
chargesum: 0.00000
title: Mulliken charges with hydrogens summed into heavy atoms:
elementType: F F O O N C C C C C C C C C C C C C
charge: -0.245530 -0.245352 -0.038946 -0.232894 -0.167584 0.465127 0.047803 0.045148 0.548708 -0.375642 -0.110060 -0.169393 -0.203484 0.042924 -0.023001 0.237791 0.238229 0.186155
polarizability: 2.08802555e+02 6.28704494e+00 1.50342530e+02 -7.39495924e+00 1.62943369e+01 1.12950735e+02
1716.lowfreq: -9.2461 -3.8108 -0.0007 -0.0006 -0.0004 4.7521 11.0127 18.5210 25.5436
frequency: 10.5715 18.2302 25.4325 50.1752 55.5206 71.1964 82.2311 93.2504 105.2843 127.0379 167.3844 177.5440 214.6936 236.3389 256.9726 295.4308 378.7576 392.6968 418.1958 449.4309 451.9125 463.5712 504.5220 526.4625 540.1927 556.7027 593.3620 628.1144 638.7562 690.9933 701.9818 775.8138 778.3897 802.9610 823.5074 843.1180 846.7857 857.7886 891.3254 911.9684 941.3005 961.8091 978.3704 995.0313 995.7782 1013.7729 1022.2116 1046.0411 1073.0759 1078.8589 1098.1317 1107.2907 1151.7623 1178.6858 1186.4761 1191.4713 1199.0555 1210.0575 1238.3281 1259.0449 1266.8700 1277.0573 1300.8629 1323.4018 1356.6475 1359.0978 1366.3856 1372.8939 1374.1696 1380.3000 1389.3454 1438.3900 1449.7592 1458.7088 1459.6336 1464.7644 1475.1409 1484.2741 1501.2296 1585.2749 1620.2716 1666.1880 2996.8943 2997.4091 2999.7639 3006.8772 3013.6163 3014.8783 3044.2535 3065.9892 3070.5108 3071.2878 3095.1089 3097.3171 3120.2230 3138.5004 3141.6383 3163.7796 3511.6154
redmass: 9.0541 6.8251 6.7899 7.4304 7.5866 2.2703 4.6555 5.1330 4.1069 2.8507 4.4090 5.5276 4.1926 3.4739 4.2569 5.3083 2.5460 2.9335 3.8332 3.4278 2.4725 3.0816 1.7873 2.7328 3.0516 2.9557 4.3006 4.7720 1.3455 3.0896 2.2167 1.6168 1.3881 3.4087 3.0662 2.1970 2.5956 1.4888 3.0683 2.1511 2.6196 1.3257 5.3498 2.2316 2.9856 2.1232 3.4890 2.8330 1.9514 2.4450 1.8853 1.7452 1.1916 1.3288 1.1095 1.1097 2.2037 1.4611 1.4261 1.5290 1.1794 1.3807 1.7394 1.3151 1.2547 1.3195 1.8084 1.3608 1.4503 4.1072 1.9242 1.0869 1.7331 1.0896 1.0948 1.3911 1.1275 1.4181 2.0334 5.9268 6.2512 8.2272 1.0629 1.0622 1.0635 1.0604 1.0589 1.0594 1.0980 1.0994 1.1021 1.0994 1.1086 1.1080 1.0859 1.0906 1.0921 1.0958 1.0639
irintensity: 1.0370 0.2359 0.1141 0.5138 1.1057 0.9535 7.0433 5.6765 6.3161 7.0036 0.9677 6.9740 0.3091 2.9903 0.7280 0.2330 0.8208 3.5439 6.9675 7.5264 16.9393 16.4402 27.0281 11.6683 34.9258 9.5063 4.6468 6.8365 123.8203 11.4964 23.5206 42.9625 8.2272 2.2038 29.4633 17.7346 12.3855 4.1617 8.5362 7.9972 27.5430 0.2364 23.4594 63.3239 40.2716 0.5670 216.5780 11.8487 3.9443 83.7364 3.8643 5.0736 3.9744 8.6051 10.8287 4.7589 29.5389 9.6884 2.6390 55.5193 2.7870 9.2320 45.3004 8.4355 2.0072 1.9120 61.4639 17.2005 74.9347 1.5213 16.7020 31.4901 24.6638 6.8200 16.5812 23.6957 18.9931 5.2283 114.3438 37.0543 241.7704 217.5197 22.2088 6.4576 5.4969 20.8921 95.9138 12.0938 0.0432 8.0287 18.7463 0.3828 36.8088 52.4451 5.4160 37.2604 12.0731 21.7532 18.6875
temp: 298.150 k
press: 1.00000 atm
elementType: 9 9 8 8 7 6 6 6 6 6 6 6 6 6 6 6 6 6 1 1 1 1 1 1 1 1 1 1 1 1 1 1 1 1 1
symmnumber: 1
zpe: 737506.7 jmol-1
zpe.correction: 0.280901 hartree
zpe.thermalcorrener: 0.299504 hartree
zpe.thermalcorrenthalpy: 0.300448 hartree
zpe.thermalcorrgfe: 0.229353 hartree
zpe.sumelectzpe: -909.093771 hartree
zpe.sumelectthermal: -909.075169 hartree
zpe.sumelectthermalent: -909.074225 hartree
zpe.sumelectthermalfe: -909.145320 hartree
dipole: -0.2238 -0.7424 -1.4571
dipole: 1.6505
quadrupole: -106.3639 -99.8521 -116.3638
quadrupole: -8.1950 1.6580 7.0906
quadrupole: 1.1627 7.6745 -8.8372 -8.1950 1.6580 7.0906
hfenergy: -909.3746725 hartree
pointgroup: C01 [X(C13H17F2N1O2)]
dipole: -0.0670718 0.2552935 0.5933028 debye
polarizability: 208.5622889|-8.3930462|148.4815897|5.6004515|18.6159978|115.0519419 unknown
InChI: InChI=1S/C13H17F2NO2/c14-6-8-16(9-7-15)12-3-1-2-11(10-12)4-5-13(17)18/h1-3,10,17H,4-9H2
charge 0 multiplicity 1
35 atoms
F  2.806568 -3.168455 0.94795
F  4.893996 0.14135 -1.464562
O  -5.709384 -0.80178 1.006447
O  -5.229087 -0.654647 -1.260205
N  2.292654 -0.361673 -0.022951
C  1.172535 0.476285 0.136912
C  2.228037 -1.594493 -0.820178
C  3.589396 -0.034071 0.586197
C  -1.245229 0.935548 -0.219983
C  -0.115464 0.099416 -0.361484
C  -2.603676 0.480865 -0.738052
C  1.276971 1.739715 0.800371
C  -1.113934 2.183285 0.441358
C  -3.515038 -0.008715 0.41324
C  0.146309 2.56755 0.945754
C  1.762063 -2.8215 -0.029356
C  4.464146 0.88724 -0.270934
C  -4.862188 -0.503229 -0.074213
H  1.562418 -1.453327 -1.693373
H  3.233077 -1.798848 -1.228127
H  4.13692 -0.975421 0.765668
H  3.43951 0.430931 1.579533
H  -0.253353 -0.860527 -0.870039
H  -3.112217 1.309993 -1.264513
H  -2.491407 -0.333126 -1.476337
H  2.235028 2.09155 1.193176
H  -1.980722 2.845944 0.547083
H  -3.029405 -0.833159 0.971172
H  -3.685052 0.790402 1.158519
H  0.260156 3.533962 1.450727
H  0.84383 -2.628082 0.551368
H  1.638706 -3.703614 -0.68524
H  3.915927 1.772461 -0.636041
H  5.385715 1.183307 0.264435
H  -6.580109 -1.134841 0.655779
