program: Gaussian 09
title: 000116824
version: EM64L-G09RevD.01
frameworkgroup: C1[X(C11H7ClO5S)]
method: RPBEPBE
basis: SDD
operation: Freq
keyword: #p
keyword: freq=noraman
keyword: PBEPBE/SDD
title: #p freq=noraman PBEPBE/SDD
converged: NO YES NO NO
title: Mulliken charges:
elementType: Cl S O O O O O C C C C C C C C C C C H H H H H H H
charge: -0.211349 0.895813 -0.389100 -0.454432 -0.462073 -0.385580 -0.247015 0.267732 0.432739 0.059932 -0.137109 -0.396259 -0.348217 -0.425155 -0.241982 0.218679 -0.405973 0.099346 0.296168 0.296683 0.257221 0.289847 0.233744 0.370557 0.385783
chargesum: 0.00000
title: Mulliken charges with hydrogens summed into heavy atoms:
elementType: Cl S O O O O O C C C C C C C C C C C
charge: -0.211349 0.895813 -0.018543 -0.454432 -0.462073 0.000203 -0.247015 0.267732 0.432739 0.059932 -0.137109 -0.100091 -0.051534 -0.167934 0.047864 0.218679 -0.172229 0.099346
polarizability: 3.09376452e+02 1.91341080e+01 1.80294995e+02 7.39880786e-01 3.12618212e+00 1.13735710e+02
1716.lowfreq: -9.4396 -5.0438 -0.0013 -0.0010 0.0012 5.4630 22.8131 39.2226 53.9033
frequency: 22.7700 39.2006 53.9011 78.2526 94.0667 99.6953 163.2901 172.4592 189.0545 200.6658 225.6836 236.6355 260.2138 316.8580 319.6463 354.1461 371.7896 378.6706 405.6154 424.1527 427.0356 475.2332 508.1649 521.9310 552.7720 570.1613 598.5162 611.3393 663.7091 679.5651 723.8013 745.8882 785.3152 809.1194 823.2455 841.4287 845.8662 906.9994 923.3254 963.1024 965.0625 982.8236 999.4232 1060.3382 1077.5054 1157.3504 1171.6602 1183.7550 1227.0993 1250.8968 1275.3841 1301.7726 1353.8599 1396.3790 1421.7923 1428.1928 1462.2877 1509.8908 1579.2303 1596.8722 1614.2375 1635.8350 3126.1702 3152.4690 3156.6967 3166.1304 3188.7094 3505.4355 3573.6602
redmass: 12.1072 11.2579 11.5574 5.7771 10.6392 9.5803 9.4168 10.8891 5.5018 7.6202 8.7266 20.2455 7.7651 7.0861 8.7413 1.4092 6.5055 3.9534 4.7575 3.8778 9.4241 3.4690 5.6861 6.8336 3.7360 2.7436 1.8269 4.7447 3.5685 5.4904 5.2705 6.9943 2.5837 1.4992 13.9826 2.1660 4.8121 1.4668 7.3029 13.8915 1.4505 1.3787 4.5807 2.3666 2.4290 1.4197 1.1790 1.5525 1.6675 2.7753 1.8243 2.1698 2.6664 3.9368 9.4600 2.8838 2.8150 4.7056 7.2660 6.7936 7.0976 7.8725 1.0884 1.0934 1.0970 1.0898 1.0960 1.0640 1.0663
irintensity: 0.6408 0.3086 1.7337 0.2827 0.4814 3.5118 2.1821 1.7173 3.9124 12.5190 3.7968 1.6011 5.5326 33.5187 13.4536 60.5430 46.1340 50.3240 20.5825 7.6851 136.8741 7.8211 14.7640 1.9926 5.8623 40.3619 91.6991 64.6483 50.3536 24.5599 18.9596 10.7145 7.7789 34.7344 85.2479 30.1065 28.3429 21.2865 117.8738 54.4282 5.7898 2.3045 41.3733 31.3218 320.6675 92.8786 14.6889 91.2107 9.1934 103.1061 39.3693 16.8279 45.3082 96.4749 26.4069 11.7692 10.0414 110.8418 15.2104 3.6680 156.7669 231.3038 7.0777 4.9066 7.4288 7.8541 1.6043 46.7412 106.8127
temp: 298.150 k
press: 1.00000 atm
elementType: 17 16 8 8 8 8 8 6 6 6 6 6 6 6 6 6 6 6 1 1 1 1 1 1 1
symmnumber: 1
zpe: 418120.0 jmol-1
zpe.correction: 0.159254 hartree
zpe.thermalcorrener: 0.176123 hartree
zpe.thermalcorrenthalpy: 0.177067 hartree
zpe.thermalcorrgfe: 0.112981 hartree
zpe.sumelectzpe: -1656.188049 hartree
zpe.sumelectthermal: -1656.171180 hartree
zpe.sumelectthermalent: -1656.170235 hartree
zpe.sumelectthermalfe: -1656.234321 hartree
dipole: 8.4728 3.8130 0.7787
dipole: 9.3238
quadrupole: -129.1920 -103.4661 -126.7799
quadrupole: 11.3908 3.6380 -4.0052
quadrupole: -9.3793 16.3466 -6.9672 11.3908 3.6380 -4.0052
hfenergy: -1656.3473024 hartree
pointgroup: C01 [X(C11H7Cl1O5S1)]
dipole: 3.349988 -1.4780751 -0.2214125 debye
dipolederiv: -0.5357488 0.0308842 -0.0998972 0.0239745 -0.2371205 0.0259506 -0.5281079 0.061735 -0.7834259 2.2466635 -0.1634507 0.1495838 0.0045039 0.9298182 -0.038699 0.2974795 -0.0526223 1.6498454 -1.7905874 0.4481418 -0.0230678 0.1722468 -0.0793161 0.0093088 -0.0276865 0.0039906 -0.3665833 -0.6885339 0.0423495 -0.0019352 0.1027272 -0.4672616 -0.1390248 0.0582787 -0.0497019 -0.4993696 -0.7112162 0.0088332 -0.0125742 -0.1518648 -0.4720017 0.1451951 0.0660885 0.0532199 -0.4787311 -0.9473833 -0.140019 0.404962 -0.2072453 -0.296935 0.1388782 0.5878075 0.1916264 -0.7396322 -0.5482329 -0.1301081 0.1206122 -0.1965128 -0.8815827 -0.3223072 0.1743923 -0.1082287 -0.5886428 0.7919689 -0.0036126 -0.0062618 -0.1581284 -0.0642113 0.0125999 -0.1087123 -0.0696042 0.0182963 -0.3957665 0.0070195 -0.0057794 0.0217377 -0.2045914 0.0042358 0.0784312 0.0021442 0.0584321 -0.8104295 -0.1114555 0.034581 0.1919533 -0.4927595 0.0080638 0.0641184 -0.0228796 -0.081317 -0.3795959 0.170401 0.0446043 0.2550667 -0.1329615 0.0174407 0.362867 -0.0488511 -0.1559328 0.2717354 -0.0631149 -0.0288388 -0.4308083 0.0367717 -0.0153831 -0.1787508 0.0068372 -0.1012248 -0.3141477 0.1083405 -0.0024722 0.0927878 0.054979 -0.0130101 -0.0020401 0.0191463 -0.0967148 0.3065433 -0.0885192 -0.0074038 -0.2218169 0.1836878 -0.0023396 0.0249302 0.0081961 -0.0995892 -0.0811768 -0.0792055 -0.042744 0.3414467 0.0408027 0.0197717 -0.1560132 0.0526677 -0.1043444 1.6986302 -0.4421263 0.0313751 -0.1480027 0.2918522 -0.0262756 0.0685697 0.0629388 0.1096876 -0.5086892 0.0141008 -0.0102306 -0.3584093 0.0693566 0.0032378 -0.0330539 0.0158356 -0.1723767 1.189899 0.5024941 -0.5863524 0.7345147 1.2982003 0.2643627 -0.7251698 0.038177 0.9516465 0.1161728 -0.0279179 0.0143765 -0.0269798 0.0600929 -0.0072956 -0.030499 0.0087313 0.1374298 0.1051637 -0.0379554 -0.0083602 0.0079701 0.0562107 0.0016088 0.0619552 -0.0095921 0.1558379 0.0553884 -0.0951399 0.0041587 -0.0299233 -0.0057053 -0.0011798 0.0101522 -0.0014682 0.1496254 0.1047864 0.0604135 0.016679 0.0110254 0.0863468 0.0032207 0.0147971 -0.016832 0.1465688 -0.0352126 0.1094846 0.0046522 0.0716643 -0.0211517 -0.0036422 -0.009841 -0.0105841 0.1683731 0.5078846 -0.0884276 -0.0007896 -0.0548959 0.097155 -0.0114527 0.0064941 -0.0085392 0.3783327 0.3518846 -0.03141 0.0111224 -0.0470315 0.1503244 -0.0732649 -0.0764871 -0.1263426 0.3438093 unknown
polarizability: 309.5885498|-18.2316094|180.0687492|3.6025878|2.1400625|113.7498577 unknown
InChI: InChI=1S/C11H7O5S.Cl/c12-9-4-1-6-5-7(17(15)16)2-3-8(6)10(9)11(13)14;/h1-5,12-13H;
charge 0 multiplicity 1
25 atoms
Cl -4.529601 0.186857 -2.083772
S  -3.986079 0.063708 0.281905
O  4.206604 -1.026898 -0.084901
O  -4.525493 1.427524 0.962857
O  -4.460316 -1.394003 0.800444
O  3.869357 1.509476 -1.06737
O  2.627399 2.50182 0.612995
C  0.686454 0.195405 0.041969
C  -0.018862 -1.073747 0.043576
C  2.1282 0.196152 -0.056165
C  -2.118272 0.110037 0.179028
C  -1.446133 -1.100476 0.102657
C  -0.08686 1.406841 0.121115
C  0.721624 -2.298428 -0.024699
C  -1.480299 1.376442 0.179731
C  2.815924 -1.036073 -0.093146
C  2.107809 -2.282262 -0.083206
C  2.872873 1.492524 -0.09266
H  -1.986918 -2.052643 0.101537
H  0.427836 2.368957 0.161524
H  0.180076 -3.250151 -0.021619
H  -2.068462 2.295632 0.25239
H  2.67226 -3.22224 -0.118083
H  4.573128 -1.945928 -0.117855
H  4.34355 2.384974 -1.025453
