program: Gaussian 09
title: 000116795
version: EM64L-G09RevD.01
frameworkgroup: C1[X(C16H27Cl)]
method: RPBEPBE
basis: SDD
operation: Freq
keyword: #p
keyword: freq=noraman
keyword: PBEPBE/SDD
title: #p freq=noraman PBEPBE/SDD
converged: YES YES NO NO
title: Mulliken charges:
elementType: Cl C C C C C C C C C C C C C C C C H H H H H H H H H H H H H H H H H H H H H H H H H H H
charge: -0.090296 -0.357304 -0.348003 -0.365936 -0.349560 -0.472362 -0.332965 -0.478552 -0.591170 -0.364193 -0.157225 -0.457155 -0.476223 -0.185060 -0.056340 -0.692816 0.007124 0.187137 0.190353 0.219398 0.197814 0.212697 0.210740 0.204227 0.228525 0.227371 0.226646 0.188519 0.202933 0.192794 0.204248 0.265528 0.255937 0.193995 0.215167 0.225580 0.216495 0.201762 0.228018 0.226928 0.219957 0.209165 0.213272 0.202833
chargesum: 0.00000
title: Mulliken charges with hydrogens summed into heavy atoms:
elementType: Cl C C C C C C C C C C C C C C C C
charge: -0.090296 0.020186 0.069208 0.057500 0.083192 -0.018345 0.058487 -0.081510 -0.069706 0.044969 0.068356 -0.038898 -0.021277 0.034896 -0.056340 -0.067546 0.007124
polarizability: 2.19589268e+02 -1.42721281e+01 1.72482586e+02 9.56006063e+00 -5.72435648e-03 1.51067606e+02
1716.lowfreq: -8.0424 -4.6958 -0.0017 -0.0015 -0.0003 3.0751 8.8463 19.2553 26.2879
frequency: 8.2144 18.9633 26.2820 35.8142 42.0398 47.8975 60.4577 79.3382 87.2561 100.6323 113.8079 127.8729 132.2138 142.2737 176.0818 214.8426 224.3961 227.5291 238.0420 255.3579 299.9474 316.2454 319.4066 348.6197 369.1079 456.7716 465.5247 471.3809 499.3954 544.9181 594.5081 720.6486 724.9156 735.9003 747.6143 796.8856 801.8268 809.0614 840.4994 853.9810 862.6220 912.2232 929.5566 933.7303 961.5446 976.8678 983.2653 997.9042 1014.9607 1041.2783 1051.9259 1056.1314 1064.1570 1075.0006 1094.6909 1101.7150 1102.4817 1116.1009 1121.1063 1161.5055 1172.4496 1174.6568 1206.9915 1214.8640 1220.7846 1236.4925 1237.8876 1264.3355 1277.3971 1281.9839 1284.5405 1284.8727 1288.6895 1296.2752 1301.9342 1303.2429 1309.0968 1327.6355 1330.7498 1341.8396 1351.0275 1357.8484 1365.1313 1386.0110 1446.0292 1449.3763 1456.5078 1456.8338 1458.3468 1458.9071 1461.2480 1464.8623 1471.6556 1474.5126 1475.8497 1483.9702 1487.7484 1686.4422 2278.5839 2950.1302 2952.9056 2954.8717 2957.3973 2960.9581 2962.4733 2966.9825 2970.2503 2970.7490 2972.0780 2983.6852 2994.3070 3000.4517 3006.5027 3013.4730 3021.2842 3021.4600 3034.5406 3040.6882 3042.2296 3048.7140 3055.3975 3062.9635 3065.9466 3068.1302 3081.8017 3128.9921
redmass: 5.0296 5.3214 3.6656 3.4104 3.1676 3.2587 3.3780 1.5884 2.8303 2.9695 2.5318 2.2673 2.6480 2.5987 3.5726 2.5340 2.5355 1.2112 2.4405 1.8449 3.6408 3.2355 3.6258 4.0022 2.7638 3.2245 2.9516 2.3150 2.7241 3.5943 4.2990 2.3480 1.0764 1.2813 1.1844 1.5016 1.6129 1.3917 1.9722 1.5954 1.8361 1.6073 1.4978 1.6867 1.7640 1.2176 2.3944 2.6977 3.4628 2.2133 2.9591 1.5687 1.8787 2.2191 1.6153 1.9453 2.0397 1.4208 1.9785 2.6517 1.4496 1.3627 1.1530 1.3976 1.3597 1.2879 1.2939 1.2065 1.2453 1.1063 1.2547 1.2022 1.1262 1.2545 1.2222 1.1452 1.2699 1.3700 1.4631 1.4927 1.5591 1.5015 1.6215 1.2146 1.0795 1.1016 1.0836 1.1012 1.0836 1.0904 1.0849 1.0661 1.0755 1.0695 1.0462 1.0901 1.0917 6.5594 11.6919 1.0594 1.0617 1.0637 1.0581 1.0585 1.0599 1.0379 1.0612 1.0624 1.0620 1.0603 1.0962 1.1002 1.0975 1.1003 1.0946 1.0952 1.1030 1.0929 1.0959 1.0723 1.0992 1.1004 1.0944 1.0998 1.0888 1.1111
irintensity: 0.8091 0.3513 1.0526 1.2517 0.3582 0.4379 0.1248 0.0905 0.9040 0.4318 0.9069 0.5159 0.7673 0.7105 0.3431 7.8665 0.8161 0.8036 3.7119 1.1167 2.8284 1.4328 1.5443 0.1289 0.1909 7.8860 1.7718 0.2161 1.3884 2.5919 20.8875 2.4231 10.2918 12.2996 2.8887 2.0072 0.3812 9.0965 1.6647 3.0172 4.1597 1.6670 8.9016 8.2731 22.2086 45.1380 6.5068 2.8144 0.9430 1.6733 0.5875 2.4741 4.8120 1.2751 1.4010 1.0390 1.6164 1.4512 3.4207 0.4765 0.2968 9.4082 0.1960 0.8525 3.7745 0.6148 1.7566 4.8975 1.3728 1.6051 8.8887 0.5825 0.6108 1.0982 0.8568 16.9014 4.1981 3.5170 4.9544 0.9942 1.5377 1.5124 1.3024 9.6320 7.4459 6.7412 6.7705 7.1387 8.8153 10.5977 3.8166 0.6213 1.9232 5.1059 18.4898 21.7074 9.1557 0.1016 1.1608 8.2939 37.2762 23.4371 46.9704 17.8743 16.0012 57.3166 51.2237 15.3122 76.4684 65.0979 17.3489 2.0112 4.3605 26.1994 19.7133 17.8574 38.9409 2.8792 10.1515 11.0982 152.3796 92.0027 30.8703 50.6996 63.3484 23.6649
temp: 298.150 k
press: 1.00000 atm
elementType: 17 6 6 6 6 6 6 6 6 6 6 6 6 6 6 6 6 1 1 1 1 1 1 1 1 1 1 1 1 1 1 1 1 1 1 1 1 1 1 1 1 1 1 1
symmnumber: 1
zpe: 1015343.7 jmol-1
zpe.correction: 0.386724 hartree
zpe.thermalcorrener: 0.408876 hartree
zpe.thermalcorrenthalpy: 0.409820 hartree
zpe.thermalcorrgfe: 0.329880 hartree
zpe.sumelectzpe: -1084.524145 hartree
zpe.sumelectthermal: -1084.501993 hartree
zpe.sumelectthermalent: -1084.501049 hartree
zpe.sumelectthermalfe: -1084.580988 hartree
dipole: 0.4760 0.0841 -2.2984
dipole: 2.3487
quadrupole: -114.6661 -112.7303 -114.5267
quadrupole: 1.0505 13.5830 -1.9570
quadrupole: -0.6917 1.2440 -0.5523 1.0505 13.5830 -1.9570
hfenergy: -1084.9108686 hartree
pointgroup: C01 [X(C16H27Cl1)]
dipole: -0.1544985 -0.0776859 -0.9077118 debye
polarizability: 220.2729241|-14.4470619|172.2951938|-6.3748221|-1.5892867|150.5713424 unknown
InChI: InChI=1S/C16H27Cl/c1-2-3-4-5-6-7-8-9-10-11-12-13-14-15-16-17/h5-6H,2-4,7-8,11-16H2,1H3
charge 0 multiplicity 1
44 atoms
Cl 5.928681 -0.276215 1.8476
C  2.401453 1.51638 -0.765191
C  3.33516 0.4558 -0.14088
C  0.933485 1.366028 -0.30999
C  4.800478 0.60846 -0.601782
C  0.009892 2.448673 -0.936703
C  -1.52612 -2.839193 -0.750837
C  -2.90479 -2.734059 -0.036661
C  5.755704 -0.442818 -0.039142
C  -0.311832 -2.841853 0.207118
C  -3.100915 -1.44076 0.728513
C  -4.217968 0.804387 1.183071
C  -3.971516 2.069561 0.2950
C  -4.031996 -0.496675 0.433146
C  -1.397822 2.331393 -0.513044
C  1.022663 -3.082109 -0.531775
C  -2.573008 2.21506 -0.150166
H  2.452247 1.450808 -1.872846
H  2.767002 2.529563 -0.495622
H  3.294938 0.528325 0.963304
H  2.970663 -0.558736 -0.404419
H  0.872423 1.435272 0.793541
H  0.551759 0.36322 -0.585675
H  4.847693 0.523346 -1.709872
H  5.175365 1.619149 -0.348865
H  0.071456 2.379958 -2.042342
H  0.397937 3.452604 -0.667414
H  -1.510191 -3.774006 -1.349185
H  -1.426846 -1.998948 -1.467569
H  -3.000836 -3.595887 0.657905
H  -3.71113 -2.837929 -0.789024
H  6.782494 -0.330173 -0.418808
H  5.395605 -1.471703 -0.197553
H  -0.45603 -3.628266 0.976436
H  -0.262208 -1.877203 0.749352
H  -2.426674 -1.261773 1.580576
H  -3.540984 0.83856 2.056837
H  -5.256806 0.87218 1.56782
H  -4.272578 2.969641 0.867957
H  -4.639707 2.023531 -0.588917
H  -4.705619 -0.662774 -0.423897
H  1.017679 -4.059617 -1.050369
H  1.87999 -3.072515 0.166837
H  1.196407 -2.300086 -1.296167
