program: Gaussian 09
title: 000116625
version: EM64L-G09RevD.01
frameworkgroup: C1[X(C14H26O)]
method: RPBEPBE
basis: SDD
operation: Freq
keyword: #pfreq=noraman
keyword: PBEPBE/SDD
title: #p freq=noraman PBEPBE/SDD
converged: YES YES NO NO
title: Mulliken charges:
elementType: O C C C C C C C C C C C C C C H H H H H H H H H H H H H H H H H H H H H H H H H H
charge: -0.211065 -0.384345 -0.384738 -0.382139 -0.386421 -0.372574 -0.372456 -0.353432 -0.381436 -0.356407 -0.461419 -0.696379 -0.110492 -0.261508 -0.105865 0.193707 0.193934 0.194556 0.194605 0.192525 0.192174 0.194949 0.197103 0.189808 0.189488 0.198707 0.193214 0.187864 0.187694 0.199979 0.217426 0.194764 0.194901 0.221093 0.213049 0.209629 0.209760 0.215457 0.223776 0.263837 0.156677
chargesum: 0.00000
title: Mulliken charges with hydrogens summed into heavy atoms:
elementType: O C C C C C C C C C C C C C C
charge: -0.211065 0.003296 0.004424 0.002561 0.005631 0.006722 0.019466 0.022126 0.035969 0.033257 -0.027277 -0.061534 0.113284 0.002330 0.050812
polarizability: 2.38884931e+02 1.38445229e+01 1.23956042e+02 1.14325207e+01 -1.86550363e+00 1.28487102e+02
1716.lowfreq: -35.3927 -10.7398 -2.4948 -0.0016 -0.0010 -0.0003 8.6940 14.2855 26.2895
frequency: -21.3015 10.9426 26.1066 30.9606 47.3578 66.7361 72.9592 91.5257 109.4641 115.7593 131.3231 142.7043 147.5754 149.9519 169.3028 200.1096 230.8394 240.1931 281.6217 321.7925 375.4871 418.8313 453.2053 489.7453 501.3854 558.0310 718.8097 720.7422 726.0979 738.9618 764.0396 798.4837 825.8535 864.0975 887.0986 916.8935 968.4852 971.7939 975.9689 988.0622 998.9141 1007.7349 1019.9322 1029.4217 1045.4837 1062.3196 1068.7787 1078.2710 1080.8105 1083.4120 1111.4249 1121.1689 1160.7048 1181.1849 1198.5701 1202.7819 1223.0439 1230.2592 1246.5836 1255.2884 1267.5503 1275.4320 1278.0309 1282.6245 1286.2746 1291.0577 1292.7848 1295.8891 1296.8512 1314.6474 1331.9495 1344.8414 1351.3384 1354.2695 1355.0860 1382.3943 1386.1522 1453.0107 1458.7025 1459.1647 1462.4000 1462.6224 1466.0637 1471.0608 1476.5454 1476.8510 1481.6661 1485.8604 1488.0666 1603.9534 1648.2955 2853.3895 2948.5936 2948.9437 2950.6383 2951.9271 2952.8896 2954.2984 2958.4256 2963.2397 2967.3639 2970.8303 2972.0137 2981.5315 2985.4222 2990.9142 2998.2836 3007.6366 3017.2633 3024.9439 3032.7867 3040.6088 3048.5645 3063.4155 3067.0979 3070.2428 3130.1165
redmass: 2.2245 3.9116 2.7335 3.8722 2.7561 2.3149 2.2772 2.3910 2.1383 2.3105 2.3051 2.0009 2.1199 5.3128 3.7481 3.4855 1.1124 2.9221 3.2988 3.5229 2.8701 3.5050 2.8926 3.0932 2.8925 4.0137 1.0583 1.0668 1.0840 1.1178 1.1681 1.2551 1.3710 1.2974 1.9060 1.2776 1.3600 1.6294 4.1119 3.6918 1.2124 2.8771 1.3983 2.8176 1.7460 2.6615 2.3999 2.3510 2.1083 2.2768 3.0078 2.7417 2.1141 1.8572 1.3293 1.4559 1.3844 1.3472 1.3654 1.2812 1.3303 1.1842 1.0405 1.2475 1.0674 1.1521 1.2254 1.1415 1.1565 1.3430 1.4031 1.4889 1.6686 1.6162 1.6490 1.2513 1.2159 1.0927 1.0732 1.0719 1.0733 1.0616 1.0805 1.0849 1.0858 1.0432 1.0897 1.0930 1.0924 7.8655 5.5807 1.0847 1.0584 1.0585 1.0590 1.0593 1.0627 1.0593 1.0592 1.0588 1.0586 1.0364 1.0606 1.0961 1.0971 1.0987 1.1006 1.1021 1.1017 1.1012 1.1031 1.1038 1.1014 1.0924 1.1007 1.0993 1.0927
irintensity: 0.7436 1.1972 0.0507 1.7271 1.0593 0.4234 0.6673 0.5558 0.2357 0.3586 0.9378 0.0155 0.3101 2.3871 1.0195 3.7893 0.0234 4.0610 1.0257 2.7484 1.9135 1.4584 1.9490 1.4431 2.5789 6.2477 19.1280 0.4413 6.5020 1.0092 3.8835 1.5548 0.3983 4.5400 5.0147 4.5034 10.7822 9.6594 0.7834 0.2581 42.1914 10.3345 3.5305 0.4555 12.2853 4.4643 4.1176 1.0362 0.2415 0.8227 11.8020 24.6277 57.0606 1.0916 7.6581 9.9133 0.4515 0.6278 0.1325 1.2063 0.1844 1.0191 0.5216 0.4541 0.3913 0.2291 0.5694 0.4139 0.7355 0.6443 1.1050 0.4294 0.7099 0.1815 0.2602 11.0512 11.1389 4.4277 0.0178 0.3024 0.1204 0.4626 1.0531 0.7573 2.4464 12.2871 1.8354 5.9644 36.9202 148.0250 226.7036 113.6809 0.0291 0.1877 0.0478 1.1929 8.4107 5.2327 1.1954 60.4697 160.3927 37.6064 111.0812 0.1193 0.4661 0.6833 0.8703 0.8212 2.4743 3.1369 2.1863 136.7099 138.8061 59.5702 98.3064 57.1369 9.5361
temp: 298.150 k
press: 1.00000 atm
elementType: 8 6 6 6 6 6 6 6 6 6 6 6 6 6 6 1 1 1 1 1 1 1 1 1 1 1 1 1 1 1 1 1 1 1 1 1 1 1 1 1 1
symmnumber: 1
zpe: 961727.0 jmol-1
zpe.correction: 0.366302 hartree
zpe.thermalcorrener: 0.385306 hartree
zpe.thermalcorrenthalpy: 0.386250 hartree
zpe.thermalcorrgfe: 0.315025 hartree
zpe.sumelectzpe: -623.058163 hartree
zpe.sumelectthermal: -623.039159 hartree
zpe.sumelectthermalent: -623.038215 hartree
zpe.sumelectthermalfe: -623.109440 hartree
dipole: 4.6935 1.1598 1.6716
dipole: 5.1155
quadrupole: -158.9649 -97.0781 -93.2125
quadrupole: -9.4556 -13.4440 -1.2931
quadrupole: -42.5464 19.3404 23.2060 -9.4556 -13.4440 -1.2931
hfenergy: -623.424465 hartree
pointgroup: C01 [X(C14H26O1)]
dipole: -1.8474645 -0.5318293 0.5954387 debye
polarizability: 238.9228238|15.0558855|123.5514617|-9.5584604|1.2819439|128.8537898 unknown
InChI: InChI=1S/C14H26O/c1-2-3-4-5-6-7-8-9-10-11-12-13-14-15/h12-14H,2-11H2,1H3
charge 0 multiplicity 1
41 atoms
O  8.524602 0.907585 -0.56961
C  -2.453755 0.289845 0.273718
C  -1.211782 -0.553662 -0.092117
C  -3.78575 -0.359716 -0.164024
C  0.12105 0.108976 0.323434
C  -5.027987 0.482253 0.205155
C  1.361219 -0.738981 -0.037664
C  -6.359611 -0.156944 -0.248745
C  2.693192 -0.062339 0.356166
C  -7.601397 0.685264 0.123263
C  3.930311 -0.930408 -0.010964
C  -8.926967 0.044579 -0.34173
C  5.230343 -0.300246 0.412916
C  6.286796 -0.011301 -0.405906
C  7.510044 0.616151 0.122954
H  -2.365602 1.293009 -0.193913
H  -2.471759 0.459766 1.370756
H  -1.203374 -0.736353 -1.187164
H  -1.291945 -1.551359 0.388379
H  -3.873861 -1.365065 0.298977
H  -3.768748 -0.524584 -1.26188
H  0.111057 0.298372 1.417248
H  0.201907 1.103351 -0.163261
H  -5.052015 0.637646 1.304318
H  -4.933836 1.491462 -0.248346
H  1.361692 -0.941377 -1.128916
H  1.289023 -1.72755 0.4625
H  -6.455532 -1.167401 0.20158
H  -6.338034 -0.308796 -1.348468
H  2.696854 0.140354 1.44697
H  2.775204 0.920958 -0.147746
H  -7.501575 1.696239 -0.322512
H  -7.625486 0.832262 1.222514
H  3.938447 -1.132623 -1.098748
H  3.821689 -1.912182 0.498791
H  -9.0657 -0.954406 0.113606
H  -8.940332 -0.084504 -1.440625
H  -9.798153 0.666177 -0.064032
H  5.318151 -0.045372 1.48362
H  6.262851 -0.235191 -1.480189
H  7.486369 0.829809 1.224196
