program: Gaussian 09
title: 000116624
version: EM64L-G09RevD.01
frameworkgroup: C1[X(C8H8N2O4)]
method: RPBEPBE
basis: SDD
operation: Freq
keyword: #pfreq=noraman
keyword: PBEPBE/SDD
title: #p freq=noraman PBEPBE/SDD
converged: YES YES NO NO
title: Mulliken charges:
elementType: O O O O N N C C C C C C C C H H H H H H H H
charge: -0.296707 -0.252512 -0.203517 -0.185047 0.019119 -0.575711 0.046865 0.253799 0.255537 -0.352966 -0.389948 -0.170077 0.186116 -0.521868 0.260942 0.291106 0.244141 0.212988 0.272067 0.236581 0.329445 0.339648
chargesum: 0.00000
title: Mulliken charges with hydrogens summed into heavy atoms:
elementType: O O O O N N C C C C C C C C
charge: -0.296707 -0.252512 -0.203517 -0.185047 0.019119 0.093382 0.046865 0.253799 0.255537 -0.092025 -0.098842 0.074064 0.186116 0.199767
polarizability: 1.44946614e+02 -4.59755652e+00 1.40077945e+02 5.27380580e-01 -4.37234555e-02 6.80552042e+01
1716.lowfreq: -2.7567 -0.0008 -0.0005 -0.0003 9.8071 12.2799 27.6922 59.8859 76.6595
frequency: 27.6803 59.8163 76.6546 100.9305 147.3999 159.0405 168.6831 173.1312 211.0257 277.2124 302.3268 363.6335 385.0669 421.1374 470.0127 491.4680 527.9670 547.5568 567.6233 586.0757 610.8351 701.7947 709.2346 715.5009 745.2466 765.4845 820.3460 855.0895 932.3764 971.9141 993.6108 1052.8884 1065.1797 1113.6247 1118.3030 1150.4355 1154.0938 1176.7300 1207.3035 1220.4364 1345.3593 1367.9451 1377.4489 1419.7390 1436.5574 1456.4638 1460.9722 1479.4265 1568.8830 1583.9563 1599.5329 1632.3922 2969.2794 3072.8195 3131.8465 3150.8222 3169.6146 3191.2629 3520.1863 3674.4628
redmass: 11.2349 4.7969 4.6710 3.8580 4.4285 4.3177 4.9378 1.2035 4.9151 5.0312 5.4148 8.3999 5.0231 4.7224 2.8260 2.0544 2.1024 4.4931 3.2547 1.9274 4.7527 7.7952 5.1881 7.7684 2.7249 5.2173 1.9427 7.6744 1.4176 8.3626 1.3369 3.1082 1.8173 1.7877 1.4535 1.4915 1.7049 1.4716 11.1215 2.6591 4.0130 11.7384 7.1732 1.7471 1.9095 1.2111 1.8718 1.0554 6.6479 2.2031 6.8459 2.0808 1.0319 1.1037 1.1025 1.0879 1.0950 1.0962 1.0454 1.1042
irintensity: 1.8943 2.6742 4.7120 17.6903 8.8592 1.4203 5.7979 1.6723 6.2684 9.8134 0.9356 1.1157 3.4621 10.8374 3.3797 36.0799 67.7659 10.3256 7.8799 89.4851 9.4982 7.6633 47.8347 24.5723 25.1460 11.3464 36.1488 23.3372 2.3263 58.0397 2.6895 13.1394 2.4716 1.4478 4.8721 5.3388 12.1167 44.2175 272.9131 64.2966 110.6995 57.7598 131.3447 39.7519 2.2467 30.1620 49.8731 15.5898 0.2681 61.1080 14.0612 312.9148 62.1373 18.5902 20.8019 5.4647 6.0880 5.0270 62.7135 30.1971
temp: 298.150 k
press: 1.00000 atm
elementType: 8 8 8 8 7 7 6 6 6 6 6 6 6 6 1 1 1 1 1 1 1 1
symmnumber: 1
zpe: 411239.3 jmol-1
zpe.correction: 0.156633 hartree
zpe.thermalcorrener: 0.169952 hartree
zpe.thermalcorrenthalpy: 0.170896 hartree
zpe.thermalcorrgfe: 0.115834 hartree
zpe.sumelectzpe: -718.933033 hartree
zpe.sumelectthermal: -718.919714 hartree
zpe.sumelectthermalent: -718.918770 hartree
zpe.sumelectthermalfe: -718.973831 hartree
dipole: 3.3757 3.1371 2.5169
dipole: 5.2509
quadrupole: -87.5291 -70.3190 -79.4389
quadrupole: -1.2737 -5.0450 -9.4106
quadrupole: -8.4334 8.7767 -0.3432 -1.2737 -5.0450 -9.4106
hfenergy: -719.0896658 hartree
pointgroup: C01 [X(C8H8N2O4)]
dipole: 1.4932885 1.1066216 0.9017739 debye
dipolederiv: -1.2456968 0.3169253 0.2143389 0.4000058 -0.5467363 -0.1201893 0.156437 -0.0557312 -0.4174961 -0.417043 0.0428642 0.1506167 0.0945578 -0.7670403 -0.2166199 0.1012956 0.0772539 -0.9218423 -0.9035822 0.1899126 -0.0510851 0.1369349 -0.5328807 0.0247049 -0.0692744 0.0299159 -0.229498 -0.5575655 -0.067487 -0.0392446 -0.0927588 -0.7382148 0.0315022 -0.0393708 0.0464937 -0.1959575 1.6033983 0.0824237 0.0941684 0.2036396 1.1395509 -0.0409127 0.1596053 -0.0730737 0.182781 -0.5929755 0.0151651 -0.040055 -0.0698425 -0.5387735 0.4648487 -0.0539758 0.4445749 -0.9059004 -0.046197 0.2848141 0.0404366 -0.1485894 -0.1138439 0.0042201 0.0243987 0.0722199 -0.0996944 -0.4511036 -0.2584291 -0.0073594 -0.3101092 0.0015846 -0.0321462 -0.0357966 0.0146393 0.071792 0.9920984 -0.4735194 -0.0717038 -0.5401394 0.1454662 0.0406229 0.0868605 -0.0282903 -0.0241331 0.0187241 -0.0173806 0.049016 0.2212008 0.0061866 -0.0099649 0.0153755 0.0047221 -0.1107849 -0.0072456 -0.0589927 0.0184905 0.233213 -0.1377798 0.0131539 0.0001337 0.0110027 -0.1145962 -0.1648952 0.1005191 -0.0001663 -0.010209 0.177686 -0.0142559 0.0053301 -0.0066329 -0.1293651 0.4263138 -0.0854749 -0.2031448 -0.0411654 1.1489265 -0.2121099 -0.0908224 -0.5468905 1.5451264 0.5447717 -0.0989727 -0.1854609 -0.1050626 0.3013234 0.0463009 -0.4122789 0.112495 0.4279071 -0.019267 -0.065401 -0.0164705 -0.0550655 0.0761591 0.0034069 -0.0128731 -0.0044525 0.1525366 0.070374 0.0573065 -0.0110248 0.0198526 0.1076319 0.004624 -0.0138443 0.0125132 0.1725285 0.0788159 -0.0002913 -0.0052796 -0.0058178 -0.0898696 0.0041641 -0.0065185 0.0045379 0.1562788 0.0429682 -0.0029746 0.0596352 -0.0845936 -0.1035277 0.1254471 0.1147382 0.0337101 -0.0207138 0.0661002 -0.0605546 -0.0833995 -0.0084504 0.0381831 -0.0802834 0.0358123 -0.0733807 0.0079051 -0.0985679 0.0992962 -0.0095206 0.1165573 0.0643601 0.0190631 -0.0407914 0.0279157 0.0611528 0.3268437 0.0120748 0.0508397 0.0360288 0.1573725 -0.0274181 0.0385721 -0.0805993 0.2097231 0.3337312 -0.0118235 0.046373 0.0098131 0.2042358 -0.0281585 0.0369873 -0.0229431 0.1822504 unknown
polarizability: 143.7913579|-5.0973905|141.0987487|-1.9632124|-2.3855257|68.1896557 unknown
InChI: InChI=1S/C8H8N2O4/c1-14-6-4-2-3-5(10(12)13)7(6)8(9)11/h2-4H,9H2,1H3
charge 0 multiplicity 1
22 atoms
O  2.586518 -0.147638 0.400077
O  0.551651 -2.246252 -0.994276
O  -3.39858 0.700971 -0.189716
O  -2.390142 -1.334414 -0.024455
N  -2.351885 -0.04566 -0.071087
N  0.137122 -2.329016 1.292553
C  0.162471 -0.145773 0.150237
C  -1.023182 0.622353 0.016237
C  1.38984 0.5707 0.2114
C  1.422431 1.98312 0.162937
C  -1.011037 2.034439 -0.043213
C  0.220276 2.712443 0.034695
C  0.262665 -1.669147 0.096125
C  3.325918 -0.473789 -0.84771
H  2.389978 2.489055 0.242057
H  -1.959654 2.566013 -0.148052
H  0.24262 3.80594 -0.00169
H  3.590258 0.452111 -1.394414
H  2.714733 -1.138838 -1.483642
H  4.238851 -0.988512 -0.514337
H  -0.107083 -1.84106 2.152177
H  0.200231 -3.347146 1.297797
