program: Gaussian 09
title: 000116543
version: EM64L-G09RevD.01
frameworkgroup: C1[X(C13H20FN3O3)]
method: RPBEPBE
basis: SDD
operation: Freq
keyword: #p
keyword: freq=noraman
keyword: PBEPBE/SDD
title: #p freq=noraman PBEPBE/SDD
converged: YES YES NO NO
title: Mulliken charges:
elementType: F O O O N N N C C C C C C C C C C C C C H H H H H H H H H H H H H H H H H H H H
charge: -0.156490 -0.274165 -0.291801 -0.205357 -0.384043 -0.285737 -0.410737 -0.369406 -0.375310 -0.372749 -0.375087 -0.351660 -0.406090 -0.356628 -0.695035 0.348294 0.258997 -0.146239 0.180551 0.121735 0.195323 0.189706 0.206667 0.188582 0.191351 0.188865 0.208067 0.230863 0.187519 0.189039 0.218372 0.252100 0.194819 0.195742 0.375346 0.216136 0.210257 0.209653 0.322729 0.375826
chargesum: 0.00000
title: Mulliken charges with hydrogens summed into heavy atoms:
elementType: F O O O N N N C C C C C C C C C C C C C
charge: -0.156490 -0.274165 -0.291801 -0.205357 -0.008697 -0.285737 -0.034911 0.015622 0.019938 0.007467 0.063843 0.024898 0.064381 0.033933 -0.058990 0.348294 0.258997 0.176489 0.180551 0.121735
polarizability: 2.18193370e+02 3.31244449e+01 1.71023681e+02 1.93927066e+01 -1.13210149e+01 1.42824553e+02
1716.lowfreq: -5.7624 -0.0005 0.0001 0.0006 4.6610 9.8013 15.2403 20.3229 43.0151
frequency: 14.2845 19.8145 43.0085 55.5713 60.8885 71.9116 77.9624 101.4469 109.9001 141.0866 147.0983 152.5190 163.6003 197.3214 204.6076 229.8619 231.7270 269.1683 300.6789 308.2896 333.4035 369.1281 386.6147 395.2293 410.4202 431.5710 458.1856 474.1039 523.3608 588.2168 652.2440 675.2050 705.7442 717.0558 722.7983 725.2661 730.1610 744.8116 756.4794 779.4333 801.5943 816.0892 831.9082 882.6406 893.2951 900.5407 919.9476 943.9976 999.2047 1005.6842 1019.4551 1037.6063 1065.4109 1078.9021 1087.5530 1090.1387 1122.2262 1134.2768 1143.7178 1188.5172 1193.4944 1205.2360 1223.3192 1234.0633 1254.5128 1265.3030 1271.0141 1284.3301 1291.5491 1294.5972 1298.4009 1300.7909 1322.8473 1347.3896 1354.4350 1357.6503 1363.3975 1368.4801 1383.3909 1390.3964 1458.0926 1459.6077 1463.3647 1464.5826 1469.9298 1476.9450 1477.6040 1484.5220 1489.5569 1522.9736 1616.0571 1642.6553 1674.1863 1709.3722 2951.5013 2952.2810 2955.0732 2962.1910 2969.1527 2972.6979 2979.4208 2986.0258 2993.7687 3005.1860 3009.1754 3022.1732 3037.0263 3048.5259 3069.6258 3071.3987 3079.3477 3183.4349 3312.1701 3515.0593
redmass: 6.7393 6.7039 4.5641 1.8484 3.3694 4.3186 10.4023 1.7319 2.8505 2.4727 2.0811 4.7570 8.5131 4.7426 3.3165 1.1993 3.8313 7.7262 3.9771 9.0416 2.8463 9.4738 5.9531 13.4084 3.9386 3.8507 2.9452 11.9854 2.6406 7.9075 5.4026 3.6240 3.3257 8.3578 1.0795 5.7364 1.1267 5.2854 1.2477 1.9282 1.6908 1.3240 1.6028 1.9736 1.6461 2.4144 1.3198 1.5391 2.5598 1.8087 2.2608 3.1476 2.5983 2.7490 2.2358 2.7221 2.5069 6.5468 2.0495 2.2543 1.9880 4.0093 1.2978 1.3783 3.3096 1.3602 1.2434 1.0374 1.1577 1.0878 1.2069 2.4300 1.2952 1.4299 1.4638 1.6700 1.7957 1.3918 6.3579 1.2175 1.0908 1.0805 1.0724 1.0707 1.0757 1.0632 1.0570 1.0865 1.0929 1.7626 4.7559 9.2611 7.5166 7.5391 1.0590 1.0590 1.0596 1.0594 1.0588 1.0366 1.0615 1.0960 1.0980 1.0934 1.0719 1.1022 1.1034 1.1018 1.1007 1.0993 1.1043 1.0930 1.0828 1.0770
irintensity: 0.5475 0.0835 0.0250 0.0077 0.2321 0.4231 3.2713 0.0066 0.0427 0.1932 0.0080 1.5979 10.1065 1.6153 2.7068 0.2925 2.9345 0.3994 11.4206 3.8805 17.4799 1.4890 1.7745 16.7261 4.1787 6.2392 0.2375 7.2914 4.2156 6.5039 0.7455 19.0465 0.6518 0.7035 14.0591 10.0130 0.3136 26.1522 19.4485 90.4711 26.7916 135.3801 34.4927 2.7617 4.0379 3.2651 38.7269 1.3218 29.0556 3.8313 42.6942 30.6104 6.1800 19.2556 8.9828 15.2199 8.5810 101.0514 17.5080 89.8968 46.0805 35.8430 6.2000 1.1009 293.8017 4.7026 1.8744 0.4359 1.0542 3.4193 5.3047 74.4447 3.7299 4.9412 1.4767 0.5579 31.9508 9.4803 36.4449 11.3034 26.8997 3.1946 1.0336 0.7565 3.6235 4.2740 10.4103 5.7505 28.7353 699.6399 101.0317 144.3114 341.9397 423.7289 2.0671 0.6333 0.5563 28.9777 127.3789 35.3429 49.7799 2.0608 2.0631 10.3057 18.0383 1.3345 41.1248 152.3714 94.7734 52.6417 15.7117 33.2945 206.8250 67.8641
temp: 298.150 k
press: 1.00000 atm
elementType: 9 8 8 8 7 7 7 6 6 6 6 6 6 6 6 6 6 6 6 6 1 1 1 1 1 1 1 1 1 1 1 1 1 1 1 1 1 1 1 1
symmnumber: 1
zpe: 854924.2 jmol-1
zpe.correction: 0.325623 hartree
zpe.thermalcorrener: 0.346743 hartree
zpe.thermalcorrenthalpy: 0.347687 hartree
zpe.thermalcorrgfe: 0.272374 hartree
zpe.sumelectzpe: -995.654769 hartree
zpe.sumelectthermal: -995.633649 hartree
zpe.sumelectthermalent: -995.632705 hartree
zpe.sumelectthermalfe: -995.708018 hartree
dipole: 4.2967 1.7527 1.9103
dipole: 5.0182
quadrupole: -144.0936 -125.2240 -122.7600
quadrupole: -7.9462 -6.0870 3.5224
quadrupole: -13.4010 5.4685 7.9325 -7.9462 -6.0870 3.5224
hfenergy: -995.9803922 hartree
pointgroup: C01 [X(C13H20F1N3O3)]
dipole: -1.7075982 0.6709875 -0.7292826 debye
polarizability: 219.711884|-32.4833152|169.1169475|18.0936347|12.4579041|143.2127721 unknown
InChI: InChI=1S/C13H20FN3O3/c1-2-3-4-5-6-7-8-15-12(19)17-9-10(14)11(18)16-13(17)20/h9,15-16H,2-8H2,1H3
charge 0 multiplicity 1
40 atoms
F  5.353897 -0.652519 1.848199
O  1.574763 2.333978 1.181665
O  1.415058 -0.444797 -2.001548
O  5.238708 -2.535144 -0.332028
N  0.437696 1.683695 -0.761692
N  2.380313 0.461692 -0.027083
N  3.321571 -1.427719 -1.105944
C  -3.880438 0.760665 0.346506
C  -2.620883 1.126625 -0.470147
C  -4.685241 -0.413837 -0.255854
C  -1.835964 2.306849 0.144648
C  -5.954105 -0.759768 0.554963
C  -0.595448 2.736095 -0.672814
C  -6.765404 -1.931307 -0.045436
C  -8.035298 -2.263968 0.767163
C  1.408607 1.585615 0.182659
C  2.310363 -0.463901 -1.101662
C  3.39975 0.370379 0.933674
C  4.360287 -0.596668 0.876318
C  4.403811 -1.609388 -0.185239
H  -3.582197 0.506162 1.385008
H  -4.53727 1.652525 0.422665
H  -1.962865 0.236538 -0.544118
H  -2.920815 1.383326 -1.508361
H  -4.035049 -1.311361 -0.320266
H  -4.97413 -0.164358 -1.298485
H  -2.502576 3.189285 0.227486
H  -1.515752 2.056738 1.174903
H  -6.603779 0.138294 0.620049
H  -5.667305 -1.011111 1.597684
H  -0.891531 2.993533 -1.706725
H  -0.133217 3.626251 -0.211769
H  -7.047612 -1.681321 -1.088762
H  -6.117677 -2.829804 -0.106137
H  0.430179 0.9765 -1.517101
H  -8.596697 -3.102989 0.316427
H  -7.778703 -2.547912 1.805298
H  -8.713424 -1.391095 0.816792
H  3.355602 1.130607 1.718171
H  3.278277 -2.098385 -1.881507
