program: Gaussian 09
title: 000116502
version: EM64L-G09RevD.01
frameworkgroup: C1[X(C24H18O4S5)]
method: RPBEPBE
basis: SDD
operation: Freq
keyword: #p
keyword: freq=noraman
keyword: PBEPBE/SDD
title: #p freq=noraman PBEPBE/SDD
converged: YES YES NO NO
title: Mulliken charges:
elementType: S S S S S O O O O C C C C C C C C C C C C C C C C C C C C C C C C H H H H H H H H H H H H H H H H H H
charge: 0.764918 0.749215 0.050958 0.051021 -0.063399 -0.621489 -0.596067 -0.550025 -0.559728 0.426497 0.413521 0.334574 0.310817 -0.392532 -0.382206 -0.353886 -0.381113 -0.373518 -0.377242 -0.413340 -0.416444 -0.230006 -0.220595 -0.183585 -0.181420 -0.232351 -0.227023 -0.215378 -0.213252 -0.228643 -0.253143 -0.244798 -0.236154 0.323567 0.344214 0.256648 0.253371 0.252875 0.251915 0.301015 0.298789 0.237557 0.234247 0.237014 0.245192 0.264248 0.330688 0.246212 0.242291 0.367048 0.358924
chargesum: 0.00000
title: Mulliken charges with hydrogens summed into heavy atoms:
elementType: S S S S S O O O O C C C C C C C C C C C C C C C C C C C C C C C C
charge: 0.764918 0.749215 0.050958 0.051021 -0.063399 -0.254441 -0.237143 -0.550025 -0.559728 0.426497 0.413521 0.334574 0.310817 -0.392532 -0.382206 -0.030318 -0.036899 -0.116870 -0.123871 -0.160464 -0.164529 -0.230006 -0.220595 0.117430 0.117369 0.005206 0.007224 0.021635 0.031940 0.035605 0.077545 0.001414 0.006136
polarizability: 4.35448879e+02 1.38933153e+01 4.14008047e+02 -3.84954193e-01 -1.37606155e+01 3.35406453e+02
1716.lowfreq: -7.5705 -1.7043 -0.0009 -0.0007 0.0005 2.0885 9.8555 12.9232 19.0914
frequency: 9.8070 12.5883 19.0704 25.8157 35.0676 46.9320 55.7720 64.9542 67.9820 77.5761 80.1232 91.8543 97.1234 106.6323 117.7690 121.6984 133.8193 180.5472 184.1068 192.5110 194.6212 216.1348 227.5880 236.1552 238.5091 248.6291 253.8508 260.5860 270.0988 288.0540 289.9837 308.7070 315.0461 330.1512 331.5736 348.4352 363.9259 377.9275 390.3696 403.4842 404.6424 440.0537 440.3265 455.0743 456.3547 477.2746 478.3473 505.1740 510.8538 534.5759 537.1074 589.7272 590.8548 611.6634 612.1879 643.6466 644.4434 680.1005 680.6829 703.6377 706.9998 741.6286 742.4183 771.6985 773.3877 782.2265 783.3097 806.9800 819.0672 868.9672 873.0312 888.5476 891.4293 926.0099 946.3138 959.3845 968.3912 972.6097 975.1760 981.5540 984.5633 989.8668 994.2472 994.6605 1000.7765 1002.0097 1011.7519 1016.7968 1017.0927 1023.5734 1030.6310 1053.9043 1054.9301 1082.1141 1083.6180 1099.5905 1106.4990 1126.7823 1126.9690 1173.3088 1174.2546 1185.2450 1191.6505 1248.3549 1249.6072 1283.9968 1285.0387 1312.8975 1315.4877 1361.2262 1363.7212 1369.5570 1369.9760 1400.0932 1401.9245 1427.4387 1427.7304 1448.4048 1448.6672 1478.9236 1479.3897 1556.2706 1556.5610 1568.5361 1568.8946 1594.7492 1597.5285 1602.0225 1603.8097 3123.1406 3125.3989 3126.7646 3131.1620 3132.3031 3132.6744 3134.9828 3136.0471 3149.3385 3149.9240 3150.2653 3151.8660 3156.9761 3167.9474 3167.9838 3168.4607 3483.6597 3493.8127
redmass: 7.4180 7.5610 8.2049 8.4732 7.2367 8.7365 12.8112 8.6582 6.4382 6.5202 7.4382 5.5414 5.1372 7.6611 7.0033 7.1953 8.5977 7.8681 7.5207 5.7538 5.7733 5.8690 5.9443 3.3731 6.5374 2.1248 3.6692 3.5067 2.2129 6.2219 5.6177 5.2491 2.8718 5.6929 5.3554 15.9471 10.0033 9.5977 10.0401 4.8774 5.6365 6.6802 6.8712 4.5756 4.0159 4.9651 5.1417 7.0371 8.0411 4.2006 4.1855 4.8121 5.0761 7.0418 7.0259 7.0037 6.9785 7.2192 7.2542 2.3581 2.5587 3.7635 3.6723 1.4118 1.4422 4.0630 3.8117 1.5474 1.4323 12.8183 12.0779 1.3947 1.3872 1.3850 1.3770 1.3318 1.3353 1.4279 1.4491 5.3017 5.7227 1.5072 3.7773 4.1560 1.3958 1.4010 1.3340 4.4046 4.8132 1.1965 1.1677 2.0983 2.0979 2.0796 1.9389 1.7360 1.6939 1.6021 1.6186 1.0628 1.0636 1.1011 1.1054 1.5738 1.5784 2.3429 2.3479 1.2725 1.2937 3.6002 3.5990 9.0444 8.3164 3.1067 2.9968 2.4028 2.4113 2.1391 2.1397 2.8016 2.7832 5.4939 5.5125 6.4412 6.3520 5.8195 5.8558 6.7042 6.8383 1.0905 1.0886 1.0880 1.0942 1.0905 1.0872 1.0885 1.0875 1.0925 1.0931 1.0936 1.0933 1.0987 1.0996 1.1003 1.1000 1.0665 1.0665
irintensity: 0.3197 0.1329 0.1600 0.1327 0.4176 1.5235 0.3444 0.1830 0.4359 0.6354 2.0372 1.6070 2.2338 0.4312 1.3210 0.7509 0.3615 3.7656 2.8254 3.1736 7.6166 2.0801 12.4527 21.9311 1.6473 43.8224 10.4144 34.5429 36.1745 19.3372 19.5857 59.9803 62.2839 3.3821 6.7049 17.0341 9.0590 0.8847 7.4533 7.6520 3.1572 3.6752 9.5427 10.9050 2.7600 0.5440 34.9030 61.5540 52.4513 2.4129 1.4534 2.4878 1.5364 3.0475 2.8518 1.0650 1.0893 3.1747 5.0777 27.7216 15.6997 6.8691 5.3260 80.3750 100.1046 10.3396 11.7299 17.0323 29.5518 88.4181 81.7802 3.1349 2.5329 0.6151 1.4422 14.8354 10.0246 4.1785 3.9505 3.9957 4.6460 0.5158 2.6976 1.7402 1.5270 1.1898 8.6555 6.5696 3.7543 49.9791 47.4525 10.0467 10.2850 7.0327 6.1407 6.3333 5.7318 2.1723 2.3415 0.7946 0.7481 1.9168 3.1005 3.2524 3.3653 8.9432 7.4509 0.8214 6.7232 9.3586 15.4028 0.8639 0.6059 6.6564 5.4906 3.5548 5.0718 60.0727 52.2822 0.4581 0.8823 3.1592 8.6142 1.7777 0.0883 5.5172 3.6170 2.7989 4.7682 28.4140 7.0735 5.8304 14.4585 3.6354 7.3456 3.8663 1.4422 7.9299 6.0866 9.9672 8.6418 9.7901 20.0105 24.1419 24.8218 21.6408 32.5215
temp: 298.150 k
press: 1.00000 atm
elementType: 16 16 16 16 16 8 8 8 8 6 6 6 6 6 6 6 6 6 6 6 6 6 6 6 6 6 6 6 6 6 6 6 6 1 1 1 1 1 1 1 1 1 1 1 1 1 1 1 1 1 1
symmnumber: 1
zpe: 926626.1 jmol-1
zpe.correction: 0.352933 hartree
zpe.thermalcorrener: 0.385886 hartree
zpe.thermalcorrenthalpy: 0.386830 hartree
zpe.thermalcorrgfe: 0.284298 hartree
zpe.sumelectzpe: -3214.065440 hartree
zpe.sumelectthermal: -3214.032487 hartree
zpe.sumelectthermalent: -3214.031542 hartree
zpe.sumelectthermalfe: -3214.134075 hartree
dipole: 2.3040 -5.0549 4.6675
dipole: 7.2557
quadrupole: -261.3232 -211.8634 -217.4581
quadrupole: 7.3318 3.4545 -12.3490
quadrupole: -31.1083 18.3515 12.7568 7.3318 3.4545 -12.3490
hfenergy: -3214.4183729 hartree
pointgroup: C01 [X(C24H18O4S5)]
dipole: 1.0214027 -1.8014495 1.9647903 debye
polarizability: 431.7100556|16.865933|416.2358358|5.6970253|-15.93524|336.9174884 unknown
InChI: InChI=1S/C24H18O4S5/c25-32(26)23-13-3-1-11-21(23)17-7-5-9-19(15-17)29-31-30-20-10-6-8-18(16-20)22-12-2-4-14-24(22)33(27)28/h1-16,25,27H
charge 0 multiplicity 1
51 atoms
S  4.818592 0.626885 -1.407128
S  -5.194369 0.110343 -1.906465
S  1.700607 4.386543 0.367976
S  -0.786576 2.900543 -1.983045
S  -0.541307 4.011235 0.011673
O  3.229444 1.04561 -2.407979
O  -5.129476 1.76092 -0.936784
O  5.845528 -0.078896 -2.465397
O  -6.775433 -0.180547 -2.215766
C  3.276534 -0.718737 0.669471
C  -3.53969 -1.196355 0.097438
C  3.008441 0.578784 1.358752
C  -2.299315 -0.687372 -0.562462
C  3.972622 -0.850839 -0.561206
C  -4.858616 -0.888712 -0.326088
C  2.535859 1.710063 0.643441
C  -2.141723 0.686016 -0.886051
C  2.807647 -1.930319 1.255356
C  -3.429233 -2.0547 1.228933
C  3.183363 0.685388 2.767244
C  -1.230792 -1.585026 -0.843318
C  2.24053 2.912147 1.324993
C  -0.942151 1.13629 -1.485955
C  4.196946 -2.085989 -1.194261
C  -6.010412 -1.380832 0.310768
C  3.011839 -3.179776 0.635021
C  -4.569761 -2.552132 1.89226
C  2.891022 1.88996 3.440871
C  -0.039569 -1.12493 -1.442334
C  2.409505 3.010845 2.725974
C  0.116545 0.241554 -1.770781
C  3.702815 -3.264259 -0.597074
C  -5.866744 -2.214519 1.439063
H  2.362904 1.644355 -0.435137
H  -2.938741 1.398795 -0.645863
H  2.247286 -1.872453 2.194646
H  -2.42885 -2.30113 1.60126
H  3.572576 -0.170746 3.329878
H  -1.349051 -2.649977 -0.612293
H  4.782885 -2.103066 -2.121572
H  -6.991937 -1.124641 -0.10671
H  2.630408 -4.089084 1.112126
H  -4.447225 -3.200577 2.766637
H  3.038067 1.959029 4.523844
H  0.774913 -1.825052 -1.657432
H  2.168816 3.945775 3.241595
H  1.049543 0.594637 -2.225112
H  3.864591 -4.233479 -1.079741
H  -6.7532 -2.599184 1.9536
H  3.457621 1.83655 -2.975359
H  -5.335277 2.480762 -1.600509
