program: Gaussian 09
title: 000116493
version: EM64L-G09RevD.01
frameworkgroup: C1[X(C18H30Cl2N2O2)]
method: RPBEPBE
basis: SDD
operation: Freq
keyword: #p
keyword: freq=noraman
keyword: PBEPBE/SDD
title: #p freq=noraman PBEPBE/SDD
converged: YES YES NO NO
title: Mulliken charges:
elementType: Cl Cl O O N N C C C C C C C C C C C C C C C C C C H H H H H H H H H H H H H H H H H H H H H H H H H H H H H H
charge: -0.083454 -0.083472 -0.273155 -0.273140 -0.112839 -0.112846 -0.416541 -0.416443 -0.329775 -0.329767 -0.341580 -0.341564 -0.286856 -0.286925 -0.571462 -0.571480 -0.661569 -0.661561 0.353501 0.353484 -0.321265 -0.388719 -0.388720 -0.321267 0.223970 0.228410 0.223921 0.228394 0.233042 0.231813 0.233033 0.231845 0.203280 0.212031 0.203264 0.212040 0.220188 0.206503 0.220184 0.206524 0.261545 0.267284 0.261560 0.267290 0.212256 0.213534 0.224134 0.212261 0.213521 0.224141 0.248378 0.247347 0.247352 0.248373
chargesum: 0.00000
title: Mulliken charges with hydrogens summed into heavy atoms:
elementType: Cl Cl O O N N C C C C C C C C C C C C C C C C C C
charge: -0.083454 -0.083472 -0.273155 -0.273140 -0.112839 -0.112846 0.035839 0.035872 0.135079 0.135111 0.073730 0.073739 0.139834 0.139783 -0.042634 -0.042630 -0.011645 -0.011637 0.353501 0.353484 -0.072887 -0.141372 -0.141369 -0.072894
polarizability: 3.27126990e+02 1.51271972e-02 2.07760474e+02 -7.12726718e-01 -3.05136767e-02 2.12018254e+02
1716.lowfreq: -0.0008 0.0013 0.0016 1.4401 2.6325 4.3293 8.3806 16.4479 17.9256
frequency: 8.3521 16.4479 17.3469 27.7915 29.0256 35.9871 46.4781 51.2342 64.8397 64.9868 73.4541 84.3561 91.6530 96.3161 134.8457 142.3717 149.2073 155.6246 162.4795 172.1096 198.6539 211.2921 222.5537 247.5215 249.7796 273.4672 292.2303 314.3695 321.6146 356.9761 369.5626 391.0902 403.6485 417.0577 428.1976 478.5172 479.2342 491.2551 499.2421 513.4744 568.4765 632.3952 652.5889 655.8755 709.2219 725.5049 766.5943 769.4735 785.1372 792.7205 793.4186 797.6538 807.7458 809.0732 819.7265 827.3936 830.0426 926.0635 942.0051 954.4063 954.6871 981.8592 984.3684 997.9371 1008.4849 1008.5616 1046.1836 1046.3253 1065.3290 1065.6329 1077.0312 1077.0824 1088.1224 1088.1697 1102.2476 1102.6149 1116.7246 1120.4588 1120.4656 1169.4086 1169.6030 1171.3893 1197.4704 1223.2367 1223.3219 1236.6050 1237.5807 1240.1394 1254.3310 1254.4755 1279.5484 1279.6408 1294.3108 1294.4270 1301.9314 1302.9601 1303.1095 1331.5984 1334.3909 1359.3448 1359.5048 1364.6373 1367.0984 1372.7725 1388.3038 1388.3637 1391.2978 1394.6395 1424.2017 1450.7466 1450.8202 1461.3699 1461.7286 1470.3836 1471.8556 1473.7313 1474.6903 1481.4322 1481.5959 1485.3977 1487.5702 1487.7460 1488.3850 1498.8029 1585.1591 1628.9947 2881.0770 2881.1284 2924.5111 2924.7093 2940.9630 2941.1342 2950.5456 2951.0209 2984.2059 2984.2369 3017.6370 3017.7012 3024.4183 3024.4248 3047.9994 3048.0247 3061.9416 3061.9659 3064.3216 3064.3783 3078.0859 3078.1550 3091.6035 3091.6221 3149.3921 3149.4604 3149.6342 3150.5084 3168.7761 3172.4728
redmass: 9.3233 6.4452 8.6230 5.5005 4.0569 3.6357 4.0243 5.1900 2.7632 2.4465 3.4034 3.5200 2.7369 2.6070 2.4956 2.3203 2.3226 1.7879 3.3389 4.2719 4.9797 3.6335 1.9040 1.4842 2.3914 3.1945 3.0828 3.3604 3.2169 7.1222 3.2387 3.4618 2.9766 3.0511 2.9862 3.8602 2.8245 3.0428 4.1831 2.3480 6.0952 6.8234 6.1682 5.9298 3.6666 5.7788 1.4167 1.2015 2.2341 1.1603 1.1738 1.2139 2.8845 1.2826 1.1776 1.5124 4.3962 1.3640 1.3436 2.2276 2.2170 7.5103 7.5677 2.5479 1.3941 1.4089 2.5259 2.5280 2.6134 2.6001 2.8693 2.8664 2.0334 2.0262 2.0802 2.0665 1.2819 1.4737 1.4744 1.3330 1.3592 1.1991 2.9446 1.8391 1.8392 1.7356 1.3614 3.0311 1.3502 1.3561 1.1200 1.1213 1.2079 1.2095 1.2937 1.3168 1.3200 1.3756 1.3515 1.3640 1.3531 1.6416 1.3344 2.3355 1.2422 1.2468 1.4006 1.6499 3.8414 1.0950 1.0946 1.0643 1.0560 1.1100 1.0619 1.0865 1.0721 1.0839 1.0749 1.1889 1.0724 1.0734 1.0799 1.8408 7.3442 6.7191 1.0708 1.0708 1.0696 1.0695 1.0676 1.0676 1.0575 1.0575 1.0356 1.0356 1.1031 1.1030 1.0891 1.0891 1.0942 1.0942 1.0598 1.0599 1.0914 1.0914 1.0985 1.0984 1.1006 1.1006 1.1069 1.1118 1.0923 1.0879 1.0963 1.0968
irintensity: 0.0165 0.2245 0.6260 0.7031 0.0923 0.2164 0.1968 0.6055 1.2580 0.0184 0.1205 0.0094 4.3573 0.0014 3.5612 0.5084 0.1696 0.2116 1.1719 5.5635 8.5232 3.4366 2.4585 0.0620 5.2636 0.3336 0.0568 0.2477 10.2266 0.1232 2.9503 6.6759 0.3115 0.0417 5.8981 6.1413 0.2855 30.2436 0.0227 18.3003 4.1557 0.3932 85.1030 119.2716 0.0023 60.6487 0.0022 9.8174 0.0016 8.5249 0.8084 1.7069 17.5298 51.8131 0.4301 39.6960 3.6252 0.0014 1.9927 2.8872 4.2056 1.1254 218.7520 84.0260 0.2528 0.9773 11.4966 23.1618 37.8336 0.1747 20.3432 45.9417 8.2810 2.8889 62.1858 6.0632 17.7492 7.8597 19.2379 3.1475 16.1690 0.4319 644.5117 31.6318 10.8459 36.0925 6.9375 10.7023 13.2403 4.4041 0.2074 0.0822 22.9957 1.3692 0.1935 40.2575 13.9942 7.4280 0.8454 4.5612 0.1579 6.8446 6.4600 16.7918 6.0416 43.5191 0.0584 26.5860 2.3097 14.9765 0.0624 11.4581 0.1395 91.8464 1.9420 35.5020 19.3554 38.1849 2.0677 112.7806 0.0114 6.4626 6.2553 221.3611 0.0350 0.0927 178.0023 12.9551 42.0351 50.1397 64.1440 57.0888 105.3644 3.0283 15.2300 37.5134 5.2310 50.1096 25.6150 5.0984 38.2438 0.0689 10.1543 10.5704 8.7439 88.2275 109.8156 7.6132 12.8421 67.7486 64.9940 3.6351 3.9386 0.0121 15.9920 0.0015
temp: 298.150 k
press: 1.00000 atm
elementType: 17 17 8 8 7 7 6 6 6 6 6 6 6 6 6 6 6 6 6 6 6 6 6 6 1 1 1 1 1 1 1 1 1 1 1 1 1 1 1 1 1 1 1 1 1 1 1 1 1 1 1 1 1 1
symmnumber: 1
zpe: 1194642.1 jmol-1
zpe.correction: 0.455015 hartree
zpe.thermalcorrener: 0.483525 hartree
zpe.thermalcorrenthalpy: 0.484469 hartree
zpe.thermalcorrgfe: 0.388432 hartree
zpe.sumelectzpe: -1882.023001 hartree
zpe.sumelectthermal: -1881.994491 hartree
zpe.sumelectthermalent: -1881.993547 hartree
zpe.sumelectthermalfe: -1882.089584 hartree
dipole: -0.0011 -4.2627 -0.0020
dipole: 4.2627
quadrupole: -155.3731 -174.3896 -161.6308
quadrupole: 0.0046 -22.3727 -0.0068
quadrupole: 8.4247 -10.5917 2.1671 0.0046 -22.3727 -0.0068
hfenergy: -1882.4780161 hartree
pointgroup: C01 [X(C18H30Cl2N2O2)]
dipole: -0.0002443 -1.6770796 -0.0025404 debye
polarizability: 326.8267384|-0.072879|207.7604118|5.9139384|0.0182779|212.3185686 unknown
InChI: InChI=1S/C18H30Cl2N2O2/c1-3-21(11-9-19)13-15-23-17-5-7-18(8-6-17)24-16-14-22(4-2)12-10-20/h5-8H,3-4,9-16H2,1-2H3
charge 0 multiplicity 1
54 atoms
Cl -7.559048 3.156105 -2.124425
Cl 7.558857 3.144669 2.132076
O  -2.594142 -0.005496 1.112287
O  2.593396 -0.005831 -1.113162
N  -6.245145 0.098233 0.355808
N  6.244547 0.094011 -0.356841
C  -4.999379 0.013587 1.149249
C  4.998579 0.011792 -1.150191
C  -6.624963 1.464217 -0.068862
C  6.624515 1.458772 0.071718
C  -7.374063 -0.728379 0.855038
C  7.37336 -0.730883 -0.859188
C  -3.769317 0.007049 0.230312
C  3.768593 0.004658 -0.231166
C  -6.974936 1.437385 -1.563504
C  6.974247 1.427667 1.566322
C  -7.179472 -2.234486 0.59712
C  7.179077 -2.237805 -0.605898
C  -1.322323 -0.008462 0.506151
C  1.321612 -0.008693 -0.507056
C  -1.099028 -0.008691 -0.894691
C  0.219881 -0.008372 -1.392497
C  -0.220613 -0.010824 1.391602
C  1.098294 -0.011382 0.893788
H  -4.900868 0.848479 1.879611
H  -5.001782 -0.923289 1.732994
H  4.900651 0.847947 -1.879229
H  5.000086 -0.924173 -1.735395
H  -5.780304 2.158169 0.093098
H  -7.485364 1.865163 0.510718
H  5.780119 2.153443 -0.088547
H  7.485141 1.861058 -0.506563
H  -7.553157 -0.551958 1.943946
H  -8.288492 -0.39389 0.330071
H  7.551922 -0.550985 -1.947613
H  8.287976 -0.397918 -0.333573
H  -3.783625 -0.891319 -0.418799
H  -3.750428 0.911472 -0.414031
H  3.782378 -0.89474 0.416529
H  3.750151 0.908088 0.414571
H  -7.809967 0.756994 -1.787841
H  -6.101979 1.194771 -2.186086
H  7.809049 0.746396 1.788828
H  6.101164 1.183617 2.18817
H  -8.048367 -2.805268 0.974135
H  -6.278999 -2.624529 1.105361
H  -7.070119 -2.427345 -0.48436
H  8.048019 -2.80726 -0.984802
H  6.278606 -2.626463 -1.115192
H  7.069926 -2.433968 0.475009
H  -1.933193 -0.009313 -1.602124
H  0.411668 -0.006773 -2.469879
H  -0.412395 -0.011102 2.468983
H  1.932453 -0.014144 1.601223
