program: Gaussian 09
title: 000116479
version: EM64L-G09RevD.01
frameworkgroup: C1[X(C10H14ClN)]
method: RPBEPBE
basis: SDD
operation: Freq
keyword: #p
keyword: freq=noraman
keyword: PBEPBE/SDD
title: #p freq=noraman PBEPBE/SDD
converged: YES YES NO NO
title: Mulliken charges:
elementType: Cl N C C C C C C C C C C H H H H H H H H H H H H H H
charge: -0.075269 -0.571457 0.263940 -0.611956 -0.714056 -0.722998 0.513335 -0.364195 -0.404170 -0.104426 -0.222597 -0.244706 0.199085 0.242205 0.236140 0.209726 0.200404 0.231416 0.203626 0.229251 0.260932 0.255320 0.259968 0.242902 0.230722 0.256858
chargesum: 0.00000
title: Mulliken charges with hydrogens summed into heavy atoms:
elementType: Cl N C C C C C C C C C C
charge: -0.075269 -0.055205 0.263940 -0.170665 -0.067787 -0.058706 0.513335 -0.104226 -0.161268 -0.104426 0.008125 0.012152
polarizability: 1.58706165e+02 -5.44087102e+00 1.26605104e+02 1.06001512e+01 6.02737909e+00 7.96991174e+01
1716.lowfreq: -11.4666 -0.0024 -0.0022 -0.0009 7.8638 16.5989 35.4058 67.5638 91.8196
frequency: 34.8179 67.2419 91.8177 181.5536 195.7580 227.7715 240.7399 245.2796 272.6975 298.8660 312.1544 374.0892 381.1154 396.6818 425.5115 429.5483 454.5553 531.8981 613.0189 652.8886 671.9851 700.1327 735.7339 791.1592 854.6123 887.2117 890.1356 907.4521 921.8966 925.0586 963.6898 979.6791 984.9188 1003.9225 1050.6701 1073.1593 1088.4258 1130.6002 1177.3607 1194.4794 1218.1643 1250.1322 1291.2117 1300.6638 1331.8790 1371.4158 1377.6779 1389.5238 1420.6064 1457.2736 1465.0052 1465.4613 1465.9736 1482.4216 1483.7090 1573.4562 1607.5129 1634.3488 2963.8537 2974.5324 2978.9997 3051.4344 3060.1147 3067.3160 3071.8474 3096.1468 3131.8178 3151.0020 3154.1855 3174.9770 3411.2875 3538.0589
redmass: 3.5238 4.2639 3.7992 5.4901 2.5458 1.2662 1.3669 2.7450 1.0250 2.4657 2.8490 2.9800 2.8542 4.1995 2.3083 2.3115 2.6430 4.0110 5.2413 1.5599 4.9719 3.0101 2.6618 1.4901 2.9233 1.6398 2.0223 1.4217 1.7631 1.4682 1.7803 1.3507 5.5666 1.3851 1.4658 2.1403 1.5188 1.3239 1.0923 2.1735 2.5151 2.1380 1.4587 1.5766 1.8557 1.2441 6.4344 1.2294 2.5436 1.0545 1.0867 2.1282 1.1415 1.0620 1.0626 6.3565 6.8509 1.0976 1.0355 1.0564 1.0437 1.0981 1.0991 1.0981 1.0981 1.1003 1.0870 1.0932 1.0931 1.0977 1.0445 1.0962
irintensity: 0.8463 0.7104 0.3704 0.2970 0.8701 18.5550 11.6643 0.3294 17.7998 7.4472 9.3093 0.7993 4.1143 8.3332 10.3007 6.2031 5.7683 8.7998 4.7202 210.3122 14.0145 20.0182 19.5072 43.1951 23.4134 8.5396 10.0762 1.0908 0.8567 1.2407 1.0725 0.8503 4.2911 0.5395 7.1307 21.2841 1.3726 10.6360 0.8834 21.2672 19.5583 36.0461 18.7752 16.4196 2.2874 22.7125 4.0339 18.0139 23.7515 1.4830 1.7664 23.2330 9.1712 13.1658 14.9797 46.3399 29.6569 41.5665 26.1436 46.6557 10.7132 9.2070 34.8680 13.9402 77.7380 30.2168 6.4487 15.7506 3.2362 6.7704 3.9031 0.3439
temp: 298.150 k
press: 1.00000 atm
elementType: 17 7 6 6 6 6 6 6 6 6 6 6 1 1 1 1 1 1 1 1 1 1 1 1 1 1
symmnumber: 1
zpe: 566864.2 jmol-1
zpe.correction: 0.215907 hartree
zpe.thermalcorrener: 0.228579 hartree
zpe.thermalcorrenthalpy: 0.229523 hartree
zpe.thermalcorrgfe: 0.176835 hartree
zpe.sumelectzpe: -903.361268 hartree
zpe.sumelectthermal: -903.348597 hartree
zpe.sumelectthermalent: -903.347652 hartree
zpe.sumelectthermalfe: -903.400341 hartree
dipole: -2.0189 0.2783 0.5481
dipole: 2.1104
quadrupole: -81.9935 -73.9440 -82.3534
quadrupole: 9.3730 -1.5240 3.1074
quadrupole: -2.5632 5.4863 -2.9231 9.3730 -1.5240 3.1074
hfenergy: -903.5771753 hartree
pointgroup: C01[X(C10H14Cl1N1)]
dipole: 0.778096 -0.2032311 0.2064777 debye
dipolederiv: -0.4776282 0.3237997 0.0483598 0.4047272 -0.5299809 -0.0332924 0.0589495 -0.0325595 -0.0934525 -0.6755122 0.0427213 0.2339898 0.1065022 -0.4467404 -0.1971111 0.2039516 -0.1817707 -0.4511977 0.6750314 0.0165852 -0.1504123 0.1184105 0.3517591 0.037198 0.0769926 0.100822 0.3134793 -0.1513653 -0.0543364 -0.0063991 -0.0185014 0.0581939 -0.0452516 -0.1729959 -0.0486027 0.0540034 -0.074956 0.00409 0.0473291 0.063804 -0.0964954 -0.1190654 0.0093115 -0.0936586 -0.043033 -0.0138998 0.013268 -0.0002467 -0.0198652 -0.0641323 0.0797604 -0.0012282 0.0755975 -0.0260235 0.3824188 0.0644904 -0.0531093 0.0080377 0.0719422 -0.0045073 -0.1463349 -0.0373194 -0.0545697 -0.3575834 0.1155002 0.0236761 0.2020359 -0.1318168 -0.0356687 0.0385847 -0.0206484 -0.1131914 -0.1637993 -0.0868044 -0.0142177 -0.1571637 -0.0307363 0.007351 0.0233344 -0.0017502 -0.1527888 0.6627597 -0.4925516 -0.112977 -0.6117231 0.7706119 0.0265672 -0.1272436 0.0299238 -0.0190258 0.0927059 -0.0314495 -0.0591086 0.0389292 0.1218601 -0.0367707 -0.0827698 -0.0236418 -0.1126228 -0.1558423 0.1186577 -0.0347803 0.1384806 -0.284079 -0.0168634 -0.0134347 -0.0142781 -0.1192985 0.0092046 0.0079765 -0.0007878 -0.028183 -0.0723866 0.1557282 0.0283793 0.0922632 -0.022034 0.0227583 0.0236169 0.0402566 0.0288185 -0.0600562 -0.1092901 0.0439768 -0.0581814 0.0247787 -0.0942229 0.0131923 0.1301415 0.0015215 0.0582645 0.007321 0.1600157 0.0169229 0.0235583 -0.08806 -0.0652658 -0.1421668 -0.0231702 0.0653979 -0.0259036 -0.1361114 -0.0623259 -0.0356897 0.088491 0.0384325 -0.0060842 0.0328006 -0.0888755 0.0896191 -0.0000548 0.1464622 -0.0324749 -0.0513669 -0.0455522 0.1186433 -0.0191554 0.0593657 0.0214581 0.1418655 0.0163551 0.0360457 -0.0974215 -0.0098442 -0.1505227 -0.0698024 0.0735472 -0.0433397 -0.1478989 -0.00645 -0.0347117 0.1025035 0.0329521 0.0163515 0.0433681 -0.0959694 -0.0709044 0.0383096 -0.1167882 0.0241686 0.063934 -0.0598903 -0.0650624 -0.1834502 0.2469113 0.0092315 -0.174784 0.0112034 0.0746402 0.1730208 0.0325472 -0.0288627 -0.0411074 0.0446845 0.2145419 -0.010668 0.1161325 0.2120529 0.0972844 -0.0530343 0.0375418 -0.0543328 -0.0233975 0.0311255 0.0414622 0.0370246 0.1280047 0.0105135 0.1154223 0.0362628 0.1043604 -0.0043352 0.0019947 0.0420262 -0.0064945 0.1308832 0.0548635 -0.0435703 0.0305323 -0.0567022 -0.0941909 0.0439816 0.040398 0.0449397 0.1388385 -0.0338319 -0.020953 0.0616531 -0.0086393 0.1006541 0.01209 0.0659667 0.0168226 0.1496602 unknown
polarizability: 156.6890347|-9.1359176|128.3453602|-12.1516393|-4.6173962|79.9759913 unknown
InChI: InChI=1S/C10H14ClN/c1-10(2,12)7-8-4-3-5-9(11)6-8/h3-6H,7,12H2,1-2H3
charge 0 multiplicity 1
26 atoms
Cl -3.482701 1.959306 0.182059
N  3.686489 0.39614 -0.618823
C  2.391185 0.245005 0.106139
C  1.323922 -0.042324 -1.009663
C  2.018325 1.518508 0.917529
C  2.539362 -0.961958 1.060048
C  -0.09906 -0.28395 -0.534192
C  -1.014227 0.79533 -0.409425
C  -0.551799 -1.592018 -0.216197
C  -2.326095 0.54817 0.032609
C  -1.874803 -1.817591 0.223871
C  -2.7844 -0.742381 0.356056
H  1.337963 0.819569 -1.707914
H  1.69551 -0.917412 -1.573468
H  1.059852 1.403323 1.455498
H  2.804891 1.734082 1.66533
H  1.932797 2.398175 0.250488
H  1.602559 -1.154727 1.610003
H  3.33499 -0.768845 1.805653
H  2.816732 -1.866982 0.491338
H  4.491496 0.452907 0.017981
H  3.686683 1.186171 -1.277564
H  -0.703559 1.813888 -0.663019
H  0.136096 -2.438044 -0.32538
H  -2.209194 -2.83351 0.46043
H  -3.812611 -0.904834 0.691217
