program: Gaussian 09
title: 000117892
version: EM64L-G09RevD.01
frameworkgroup: C1[X(C13H19NO4S)]
method: RPBEPBE
basis: SDD
operation: Freq
keyword: #p
keyword: freq=noraman
keyword: PBEPBE/SDD
title: #p freq=noraman PBEPBE/SDD
converged: YES YES NO NO
title: Mulliken charges:
elementType: S O O O O N C C C C C C C C C C C C C H H H H H H H H H H H H H H H H H H H
charge: 0.972921 -0.536359 -0.535338 -0.415923 -0.234341 -0.267893 -0.408986 -0.380831 -0.332612 -0.363432 -0.489849 -0.637919 -0.054126 -0.238528 -0.247401 0.173124 -0.218902 -0.214955 -0.215670 0.210925 0.208470 0.253538 0.211557 0.192232 0.228225 0.210329 0.213486 0.254774 0.256949 0.272462 0.212231 0.251959 0.283782 0.286377 0.242603 0.242854 0.239227 0.375043
chargesum: 0.00000
title: Mulliken charges with hydrogens summed into heavy atoms:
elementType: S O O O O N C C C C C C C C C C C C C
charge: 0.972921 -0.536359 -0.535338 -0.040880 -0.234341 -0.267893 0.010408 0.084264 0.087845 0.060383 0.021874 0.098733 -0.054126 0.045254 0.038976 0.173124 0.023701 0.027898 0.023557
polarizability: 2.46956544e+02 -1.49419470e+01 1.59065298e+02 5.34303845e+00 8.52226424e+00 1.54184205e+02
1716.lowfreq: -18.0295 -3.9296 0.0009 0.0017 0.0020 2.4561 12.7793 14.1815 16.1997
frequency: 6.8858 12.7967 15.8173 35.3682 46.5872 55.0194 60.1928 81.7431 92.2383 125.1428 140.5648 158.9685 184.9567 211.0074 225.1505 238.4034 246.0995 268.0742 278.1538 303.4189 333.7159 380.3564 397.1206 403.7678 427.4916 441.6871 476.8932 501.7294 512.2337 549.6445 592.7525 602.4005 637.3539 650.6993 693.3172 728.1235 758.3018 766.9079 808.7294 823.0113 846.0732 853.7402 889.7038 911.9703 933.8919 949.6287 978.5497 983.5357 1000.7828 1005.6705 1006.8306 1029.7837 1042.4019 1051.4076 1068.5941 1075.7276 1083.2662 1091.9628 1099.1621 1118.2994 1168.5771 1173.2626 1176.2345 1176.7321 1228.0326 1241.1298 1254.5455 1284.9217 1289.2473 1292.5842 1300.8566 1326.8778 1350.1147 1365.2630 1374.1212 1382.2339 1414.5490 1433.7864 1436.8845 1450.1253 1459.7773 1462.5101 1465.1929 1468.7360 1474.0910 1485.8292 1575.9520 1600.0309 1667.3642 2908.4251 2919.4323 2970.5658 2975.9918 2986.2408 2994.1644 3014.0972 3024.9039 3037.0663 3041.6466 3045.5542 3063.5622 3092.4686 3136.9760 3146.5269 3155.7908 3164.1219 3174.1608 3511.8036
redmass: 5.9345 6.4934 8.1577 3.8024 4.2112 4.0358 2.1250 3.0085 4.7243 2.3001 5.9515 4.6906 4.7024 1.5529 3.5003 3.5130 2.6018 5.4221 4.0113 4.5867 4.5313 4.2439 5.7041 2.8452 3.3609 9.1506 3.5271 1.7850 4.2537 3.6072 4.1885 6.4742 1.3242 7.0416 2.4568 1.1252 1.4031 1.5536 12.5981 2.3330 3.6085 1.2403 1.9912 1.6786 1.3481 13.5361 5.9672 1.3906 2.9609 1.3618 4.2950 2.1575 2.0679 1.9046 2.7486 1.5634 1.9499 1.6426 2.0386 1.6114 1.9295 1.0618 2.2442 1.1259 1.3640 1.3371 1.4621 1.1370 1.2149 1.1667 1.3078 1.4330 1.2893 1.5082 1.8455 8.5621 1.1432 2.2064 1.0843 2.0098 1.0680 1.0817 1.0512 1.0711 1.0651 1.0956 5.7784 6.8473 8.1788 1.0661 1.0461 1.0616 1.0611 1.0616 1.0600 1.0958 1.0987 1.0961 1.0874 1.0990 1.1030 1.0990 1.0857 1.0884 1.0926 1.0968 1.1016 1.0639
irintensity: 1.2832 1.5144 1.7889 0.2686 0.4606 1.5831 0.5392 0.2973 0.6764 0.3309 1.4383 0.3406 1.8964 0.7276 4.4047 0.9237 6.0401 0.4788 2.3188 0.5240 12.6041 8.6733 2.0984 0.0149 23.1351 66.0534 29.3339 28.3993 111.6699 8.1841 17.7759 0.0142 125.9961 5.0179 32.3294 15.2255 64.8144 2.5779 67.0271 32.5853 1.8252 0.3499 18.0432 4.3711 0.8139 71.4192 2.4386 0.1381 74.7549 1.1107 0.4875 131.5625 26.1890 33.7552 17.7611 3.5979 43.8920 17.2052 10.2687 2.4969 11.6345 0.1984 10.0731 4.2668 19.5465 2.7485 19.5222 6.0696 6.7083 2.6994 3.6709 38.4022 3.6635 3.3168 38.8752 3.8464 19.6063 16.5250 30.4098 15.1180 1.7822 4.3618 8.5989 8.3820 36.0098 21.8300 4.2385 0.5272 209.8315 49.2901 54.3336 4.5132 34.3521 18.4834 35.8210 6.5273 1.6686 5.7343 20.0515 7.0991 77.3724 1.5799 0.6266 8.8023 1.2722 5.1292 28.2909 18.5422
temp: 298.150 k
press: 1.00000 atm
elementType: 16 8 8 8 8 7 6 6 6 6 6 6 6 6 6 6 6 6 6 1 1 1 1 1 1 1 1 1 1 1 1 1 1 1 1 1 1 1
symmnumber: 1
zpe: 792148.4 jmol-1
zpe.correction: 0.301713 hartree
zpe.thermalcorrener: 0.323049 hartree
zpe.thermalcorrenthalpy: 0.323993 hartree
zpe.thermalcorrgfe: 0.245620 hartree
zpe.sumelectzpe: -1258.854519 hartree
zpe.sumelectthermal: -1258.833183 hartree
zpe.sumelectthermalent: -1258.832239 hartree
zpe.sumelectthermalfe: -1258.910612 hartree
dipole: 3.0356 -4.5216 2.0837
dipole: 5.8311
quadrupole: -101.1183 -131.9464 -121.7419
quadrupole: -20.2641 11.0235 9.7231
quadrupole: 17.1506 -13.6776 -3.4730 -20.2641 11.0235 9.7231
hfenergy: -1259.1562319 hartree
pointgroup: C01 [X(C13H19N1O4S1)]
dipole: -1.2607339 1.916566 -0.0178245 debye
polarizability: 247.9283628|-12.4938206|150.6224442|1.7488771|-7.2329727|161.6552401 unknown
InChI: InChI=1S/C13H19NO4S/c1-14(11-7-3-6-10-13(15)16)19(17,18)12-8-4-2-5-9-12/h2,4-5,8-9,15H,3,6-7,10-11H2,1H3
charge 0 multiplicity 1
38 atoms
S  -1.788754 -1.318846 0.181116
O  -2.038254 -2.305128 1.449816
O  -1.270443 -1.839417 -1.270052
O  7.211513 -0.788535 -0.253702
O  6.64092 1.400553 0.264103
N  -0.464371 -0.094797 0.759838
C  1.303507 1.416873 -0.128671
C  -0.143644 0.89641 -0.301384
C  2.370893 0.313158 -0.281728
C  3.803796 0.853648 -0.089999
C  4.863461 -0.25113 -0.259078
C  -0.804735 0.456383 2.090319
C  -3.413506 -0.374253 -0.114447
C  -3.646017 0.159616 -1.393445
C  -4.319477 -0.268762 0.954638
C  6.280045 0.244849 -0.049674
C  -4.858048 0.858033 -1.602113
C  -5.526165 0.432957 0.725466
C  -5.789581 0.997392 -0.545465
H  1.462606 2.204986 -0.892908
H  1.412945 1.913588 0.856167
H  -0.217816 0.374233 -1.273887
H  -0.860257 1.7504 -0.294865
H  2.273389 -0.147644 -1.286448
H  2.160552 -0.492024 0.448022
H  4.004624 1.667444 -0.813791
H  3.906822 1.307592 0.914615
H  4.807587 -0.709077 -1.266002
H  4.687382 -1.082812 0.451617
H  -1.16923 -0.363465 2.732025
H  -1.554595 1.278657 2.057293
H  0.12455 0.847219 2.54146
H  -2.923123 0.0025 -2.200624
H  -4.100876 -0.747737 1.91473
H  -5.076693 1.281263 -2.58807
H  -6.259248 0.528473 1.533217
H  -6.728057 1.535628 -0.716703
H  8.129497 -0.432327 -0.104287
