program: Gaussian 09
title: 000116466
version: EM64L-G09RevD.01
frameworkgroup: C1[X(C20H21NO)]
method: RPBEPBE
basis: SDD
operation: Freq
keyword: #p
keyword: freq=noraman
keyword: PBEPBE/SDD
title: #p freq=noraman PBEPBE/SDD
converged: YES YES NO NO
title: Mulliken charges:
elementType: O N C C C C C C C C C C C C C C C C C C C C H H H H H H H H H H H H H H H H H H H H H
charge: -0.210286 -0.100454 0.208926 -0.464575 0.454674 0.202407 0.300300 -0.515806 -0.325820 -0.315518 0.088929 0.415498 -0.467685 -0.375621 -0.479867 -0.471857 -0.368073 -0.683065 -0.678632 -0.432822 -0.258562 -0.245605 0.210855 0.235404 0.176879 0.238195 0.176695 0.209283 0.271475 0.240765 0.247474 0.240696 0.237206 0.237006 0.198906 0.203947 0.246536 0.208875 0.202810 0.236809 0.240828 0.231651 0.231220
chargesum: 0.00000
title: Mulliken charges with hydrogens summed into heavy atoms:
elementType: O N C C C C C C C C C C C C C C C C C C C C
charge: -0.210286 -0.100454 0.208926 -0.018316 0.454674 0.202407 0.300300 -0.244331 0.089255 0.070460 0.088929 0.415498 -0.226920 -0.128146 -0.239172 -0.234651 -0.131067 -0.033676 -0.030138 -0.191994 -0.026911 -0.014385
polarizability: 3.94596617e+02 -1.94071466e+01 2.51242902e+02 -6.32905689e+00 1.34020016e+01 1.20938842e+02
1716.lowfreq: -3.9623 -0.0004 0.0001 0.0004 3.5381 11.2005 20.5391 34.4550 44.7713
frequency: 20.2216 34.3233 44.6981 69.3621 78.4855 87.3882 90.2026 109.8942 152.8823 154.7676 177.3009 204.5833 237.7813 244.3088 260.8852 274.2136 285.3714 301.9691 356.6292 396.9573 401.6367 425.1525 428.7492 430.7109 459.3920 491.0581 500.7019 524.1507 535.2050 565.9460 593.1764 622.4563 635.4227 708.8717 711.0451 731.6696 749.7579 760.2995 777.4948 797.6377 802.8941 805.1565 812.6076 853.0605 862.6333 870.2367 890.3791 908.2668 945.8706 959.1668 968.8683 971.5543 984.7418 990.3307 995.5014 1011.0992 1038.1127 1040.3343 1074.9975 1084.8297 1092.0795 1102.3947 1108.4541 1156.1472 1158.3132 1170.8637 1178.5245 1190.9195 1222.7122 1231.7653 1236.5581 1253.0138 1257.9417 1279.0734 1288.3777 1299.8189 1310.6197 1344.9673 1370.3943 1375.4436 1385.8335 1386.7921 1388.0156 1400.8698 1413.7414 1426.1629 1435.8050 1447.0772 1452.5884 1464.0943 1464.6337 1469.7777 1478.8837 1483.9632 1491.6728 1509.3852 1519.4658 1564.2869 1587.3334 1610.1007 1626.6753 1628.9838 2789.7928 2837.6707 2855.3719 2982.2374 2983.0350 3016.1395 3039.1202 3059.9675 3072.0951 3080.2598 3094.7023 3100.7209 3119.7873 3123.3774 3126.4701 3136.5182 3144.7956 3150.2500 3157.4276 3159.2717 3169.2674
redmass: 4.6012 3.7222 3.0255 4.4083 2.6554 2.5337 3.5065 4.1787 4.0734 2.5982 1.7918 1.4014 2.0045 4.0654 4.1299 2.5846 2.5826 3.1042 2.9665 3.0920 5.6862 4.7832 3.1680 3.0534 3.5542 3.3752 3.9245 5.1080 2.9399 3.0676 6.3788 6.9224 3.2215 5.8478 5.4325 2.4827 2.9785 1.3344 2.6269 1.1931 1.4894 1.6994 1.6844 4.9916 1.7507 4.2357 1.7109 2.0425 1.6425 1.3756 1.5025 3.3515 1.7215 1.6527 1.3747 2.6864 2.7750 2.0926 1.8845 2.5868 1.9967 2.0697 1.8579 1.3294 1.8621 1.3245 1.1051 2.1169 2.1835 1.8412 2.3858 1.5349 1.3768 1.4694 1.3347 1.3018 2.0578 1.5645 1.3567 1.3050 1.2771 2.7046 1.4488 3.7144 2.7095 3.0564 1.2409 3.1949 2.4059 1.0519 1.0809 1.0558 1.0508 1.0568 1.0804 3.5727 3.6987 7.1915 8.2243 5.9118 6.5985 7.2551 1.0705 1.0725 1.0719 1.0362 1.0361 1.0822 1.0871 1.0926 1.0974 1.0930 1.1001 1.0999 1.0864 1.0867 1.0883 1.0889 1.0983 1.0932 1.0926 1.0950 1.0980
irintensity: 1.0525 0.0155 0.1171 0.8660 1.0884 1.0422 1.1003 0.3496 0.3177 0.6029 2.0061 1.1131 2.1474 0.6792 4.8137 1.3007 2.2975 1.6678 5.1718 0.3909 0.5139 3.9075 5.8814 7.1187 8.1197 3.0180 1.1645 0.3652 0.8451 5.7942 13.9360 6.8130 12.8099 0.5797 10.8598 0.3177 6.8205 61.3465 14.9593 6.1506 16.6235 0.6706 2.7685 8.1098 86.9790 3.7095 8.2363 0.5142 8.3794 1.6332 15.3489 62.6778 1.5026 0.7827 0.0097 10.3587 49.1143 4.0674 15.6530 15.1049 45.4429 0.6534 29.2180 4.0706 41.9889 10.9251 21.0703 258.6421 9.0669 5.3013 0.8417 30.6133 9.3863 4.7002 10.9058 21.3726 2.5579 11.8478 12.8529 2.2413 23.6186 39.0193 17.1138 17.0384 1.0075 21.6330 8.4361 0.9475 0.3567 6.9592 1.5867 12.6742 2.2948 9.2088 10.1277 12.1808 4.6374 32.8599 83.0817 7.3984 0.6475 18.0030 102.6360 70.8000 201.6480 32.3767 41.7783 25.9641 12.7408 8.5675 82.3718 58.0768 29.4011 37.4146 0.3078 3.6962 8.4092 5.0607 32.7965 26.4006 4.2342 26.1155 22.1769
temp: 298.150 k
press: 1.00000 atm
elementType: 8 7 6 6 6 6 6 6 6 6 6 6 6 6 6 6 6 6 6 6 6 6 1 1 1 1 1 1 1 1 1 1 1 1 1 1 1 1 1 1 1 1 1
symmnumber: 1
zpe: 931688.8 jmol-1
zpe.correction: 0.354862 hartree
zpe.thermalcorrener: 0.374947 hartree
zpe.thermalcorrenthalpy: 0.375891 hartree
zpe.thermalcorrgfe: 0.304937 hartree
zpe.sumelectzpe: -903.137144 hartree
zpe.sumelectthermal: -903.117059 hartree
zpe.sumelectthermalent: -903.116115 hartree
zpe.sumelectthermalfe: -903.187069 hartree
dipole: -1.2258 -2.9841 -0.9035
dipole: 3.3502
quadrupole: -108.7475 -120.6345 -136.1716
quadrupole: -7.4049 -3.3024 1.1744
quadrupole: 13.1037 1.2167 -14.3204 -7.4049 -3.3024 1.1744
hfenergy: -903.4920059 hartree
pointgroup: C01 [X(C20H21N1O1)]
dipole: -0.455392 1.1602143 0.4287535 debye
polarizability: 394.1137574|10.7861324|246.6514129|24.2433834|24.4769639|126.0131911 unknown
InChI: InChI=1S/C20H21NO/c1-3-21(4-2)14-20(22)17-12-11-16-10-9-15-7-5-6-8-18(15)19(16)13-17/h5-13H,3-4,14H2,1-2H3
charge 0 multiplicity 1
43 atoms
O  2.045367 -1.650311 -0.013609
N  4.588163 -0.444476 0.358503
C  -1.696562 0.329136 0.105603
C  3.368066 0.350636 0.513772
C  -1.730105 1.734362 0.439477
C  -2.955809 -0.370646 -0.174023
C  0.771561 0.366433 0.3335
C  -0.431189 -0.31757 0.064171
C  4.76441 -1.477479 1.41667
C  5.796449 0.394011 0.146696
C  2.057453 -0.41423 0.251899
C  -4.196016 0.364084 -0.104257
C  -0.505578 2.421153 0.710358
C  0.723078 1.760029 0.66071
C  -2.994205 2.430172 0.497709
C  -4.179735 1.769686 0.236238
C  -3.012939 -1.756431 -0.514853
C  5.6089 -2.67396 0.941182
C  5.866798 1.017958 -1.26088
C  -5.431547 -0.302341 -0.372958
C  -4.23552 -2.391422 -0.775341
C  -5.457016 -1.661916 -0.704435
H  3.278816 0.821695 1.532187
H  3.396509 1.19568 -0.201041
H  5.213205 -1.031196 2.341313
H  3.763883 -1.853529 1.685653
H  5.881317 1.198992 0.923096
H  6.676818 -0.259312 0.281166
H  -0.340376 -1.380194 -0.181248
H  -0.547413 3.487286 0.962761
H  1.6419 2.313779 0.876324
H  -2.993655 3.495775 0.75486
H  -5.136069 2.304152 0.282592
H  -2.09134 -2.342493 -0.577339
H  6.634561 -2.377775 0.653787
H  5.692764 -3.428666 1.745554
H  5.12488 -3.139083 0.066003
H  6.812706 1.577429 -1.386113
H  5.038528 1.725399 -1.45111
H  5.817949 0.224922 -2.026673
H  -6.364229 0.27148 -0.315405
H  -4.251218 -3.455314 -1.035556
H  -6.408059 -2.165105 -0.909243
