program: Gaussian 09
title: 000116444
version: EM64L-G09RevD.01
frameworkgroup: C1[X(C9H11Cl2O2PS3)]
method: RPBEPBE
basis: SDD
operation: Freq
keyword: #p
keyword: freq=noraman
keyword: PBEPBE/SDD
title: #p freq=noraman PBEPBE/SDD
converged: YES YES NO NO
title: Mulliken charges:
elementType: Cl Cl S S S P O O C C C C C C C C C H H H H H H H H H H H
charge: -0.038145 -0.039674 0.057016 0.262069 -0.215957 0.616645 -0.452573 -0.462373 -0.139252 -0.854137 -0.269325 -0.205463 -0.053093 -0.038222 -0.222489 -0.475199 -0.478914 0.348450 0.324534 0.288350 0.292351 0.286616 0.240665 0.253071 0.240465 0.250767 0.249217 0.234602
chargesum: 0.00000
title: Mulliken charges with hydrogens summed into heavy atoms:
elementType: Cl Cl S S S P O O C C C C C C C C C
charge: -0.038145 -0.039674 0.057016 0.262069 -0.215957 0.616645 -0.452573 -0.462373 -0.139252 -0.181154 0.019025 0.086889 -0.053093 -0.038222 0.064127 0.259002 0.255671
polarizability: 3.03330926e+02 2.76363916e+01 2.08697099e+02 6.83740465e+00 -4.14483894e+00 1.32654342e+02
1716.lowfreq: -18.6343 -10.5221 -6.6674 -0.0021 -0.0016 -0.0012 4.4015 7.4110 16.6721
frequency: -14.7945 2.4876 16.0247 35.5219 46.4332 59.0227 75.3703 104.6382 124.3409 124.7305 135.8848 146.4680 150.5833 162.4440 174.4334 189.8779 198.1945 205.6157 245.8813 283.2551 300.6656 346.4141 349.1128 361.0324 371.0275 400.7813 407.5603 413.4703 516.5086 523.0729 537.3492 586.4367 633.9678 661.0507 665.8474 691.2809 749.5002 751.1060 828.8886 866.4922 884.2119 893.0721 951.2214 975.4463 984.2429 1089.8191 1098.3088 1111.9936 1112.2572 1115.5322 1123.9474 1133.0876 1160.6418 1227.3310 1246.3724 1362.7125 1388.5845 1390.6630 1403.0547 1421.0164 1425.2091 1454.8351 1456.6544 1459.9528 1468.5939 1558.4761 1568.5537 2981.9044 2982.6616 3047.2952 3084.5080 3086.7708 3134.1716 3135.1435 3140.8991 3179.9558 3182.2893 3187.6927
redmass: 4.7583 11.8530 11.0996 14.5947 4.2795 7.8290 2.7873 2.9629 3.4985 1.5262 1.4141 4.3310 5.0225 7.1038 17.5586 5.1651 4.7677 5.2893 5.3552 4.4576 12.0949 5.1195 14.9302 6.9356 8.6977 8.7682 9.4467 5.4815 5.2284 15.2840 5.0373 8.0466 8.4041 10.2195 2.6695 12.3583 10.9668 9.7179 1.5519 1.4707 1.4202 1.3631 10.8419 6.5597 11.4937 1.5055 1.5154 1.8890 2.7230 1.2500 1.2943 1.3045 1.0268 1.0992 1.1743 10.3612 1.1372 2.5770 2.5093 1.1202 1.1182 1.0484 1.0501 1.0491 1.0520 7.3007 7.9675 1.0302 1.0304 1.0554 1.1049 1.1058 1.1026 1.1022 1.1107 1.0931 1.0938 1.0939
irintensity: 0.1214 0.1143 0.1423 0.0707 1.1780 0.9869 7.6202 1.0071 1.5505 0.7544 0.6286 8.2138 2.9237 2.7523 0.4732 1.2751 0.5392 1.3678 6.8848 4.2107 1.6473 14.2379 1.9554 33.7467 51.6428 2.9385 8.1317 0.1610 0.1705 223.1570 5.9846 6.7345 62.4667 57.7610 43.1083 107.8805 84.5443 49.0149 22.7383 39.9045 14.6427 2.4450 274.2199 1.2199 21.4554 10.8666 0.5024 6.3748 13.7876 0.7717 1.9908 0.1413 5.7748 52.6256 0.4114 0.0355 22.5860 42.6447 45.2111 4.8614 5.8365 9.0873 20.1856 11.8175 19.0738 123.8035 114.1779 68.2810 13.2595 2.9300 17.8462 25.9891 7.4845 7.1573 5.9080 1.2219 1.0880 1.0626
temp: 298.150 k
press: 1.00000 atm
elementType: 17 17 16 16 16 15 8 8 6 6 6 6 6 6 6 6 6 1 1 1 1 1 1 1 1 1 1 1
symmnumber: 1
zpe: 484797.8 jmol-1
zpe.correction: 0.184650 hartree
zpe.thermalcorrener: 0.205439 hartree
zpe.thermalcorrenthalpy: 0.206383 hartree
zpe.thermalcorrgfe: 0.129119 hartree
zpe.sumelectzpe: -2954.220860 hartree
zpe.sumelectthermal: -2954.200071 hartree
zpe.sumelectthermalent: -2954.199127 hartree
zpe.sumelectthermalfe: -2954.276390 hartree
dipole: 0.0709 -1.8076 -0.7079
dipole: 1.9426
quadrupole: -151.6595 -149.4077 -136.2157
quadrupole: -7.1921 -4.7780 8.2084
quadrupole: -5.8985 -3.6467 9.5452 -7.1921 -4.7780 8.2084
hfenergy: -2954.4055099 hartree
pointgroup: C01 [X(C9H11Cl2O2P1S3)]
dipole: -0.0444514 0.2565185 -0.7185525 debye
polarizability: 299.5369896|27.9745817|174.4427216|-18.8209251|-40.3176584|170.702656 unknown
InChI: InChI=1S/C7H5Cl2S2.C2H6O2PS/c8-5-1-6(9)3-7(2-5)11-4-10;1-3-5(6)4-2/h1-3H,4H2;1-2H3
charge 0 multiplicity 1
28 atoms
Cl 3.282464 -2.149621 2.42864
Cl 5.568916 1.308117 -1.266951
S  -1.382716 -1.299964 -0.294467
S  0.073431 1.567776 -0.291794
S  -4.679244 -1.860488 1.216646
P  -3.542821 -0.564828 0.090455
O  -3.363125 1.082616 0.589332
O  -4.073221 -0.119551 -1.500874
C  1.712473 0.774647 0.02119
C  -0.770632 0.202019 -1.27742
C  2.84469 1.262641 -0.672994
C  1.830368 -0.263214 0.976952
C  3.107083 -0.811011 1.209032
C  4.099883 0.688629 -0.389604
C  4.262872 -0.353003 0.54473
C  -2.968024 1.335202 1.99503
C  -4.680157 -1.18286 -2.333553
H  -1.635458 0.670801 -1.77231
H  -0.067616 -0.195044 -2.02435
H  2.744337 2.064019 -1.408889
H  0.954698 -0.627395 1.519551
H  5.244882 -0.785848 0.748826
H  -3.616884 0.773758 2.691594
H  -3.110473 2.417623 2.125075
H  -1.905764 1.071964 2.144979
H  -5.003123 -0.660877 -3.245897
H  -5.547031 -1.633959 -1.819028
H  -3.93651 -1.963049 -2.5799
