program: Gaussian 09
title: 000116430
version: EM64L-G09RevD.01
frameworkgroup: C1[X(C20H34N2O4)]
method: RPBEPBE
basis: SDD
operation: Freq
keyword: #p
keyword: freq=noraman
keyword: PBEPBE/SDD
title: #p freq=noraman PBEPBE/SDD
converged: YES YES NO NO
title: Mulliken charges:
elementType: O O O O N N C C C C C C C C C C C C C C C C C C C C H H H H H H H H H H H H H H H H H H H H H H H H H H H H H H H H H H
charge: -0.434302 -0.183721 -0.405172 -0.215853 -0.121229 -0.140848 -0.457396 -0.326963 -0.458468 -0.339116 -0.558251 -0.552652 -0.564215 -0.542687 0.255085 -0.329938 -0.535492 0.129131 -0.335122 -0.550846 0.297597 0.503968 -0.323490 -0.347512 -0.445910 -0.366731 0.282354 0.291475 0.328420 0.275516 0.287658 0.286834 0.303845 0.274737 0.265644 0.255552 0.318364 0.268958 0.266486 0.282039 0.268411 0.253869 0.312741 0.262374 0.261629 0.278572 0.195570 0.234661 0.259280 0.277823 0.228996 0.220619 0.249828 0.266207 0.241559 0.289737 0.260226 0.247904 0.384580 0.367666
chargesum: 2.00000
title: Mulliken charges with hydrogens summed into heavy atoms:
elementType: O O O O N N C C C C C C C C C C C C C C C C C C C C
charge: -0.049722 -0.183721 -0.037506 -0.215853 -0.121229 -0.140848 0.116432 0.276972 0.116024 0.239466 0.281309 0.264831 0.270807 0.259889 0.255085 0.100293 0.001611 0.129131 0.114492 -0.034810 0.297597 0.503968 -0.081931 -0.057775 -0.185684 -0.118827
polarizability: 3.46229612e+02 1.18282623e+01 1.87653830e+02 5.90614040e+00 -9.17031306e+00 2.12763608e+02
1716.lowfreq: -5.4012 -0.0014 -0.0004 0.0013 0.2618 4.1046 12.0963 14.2757 20.1122
frequency: 9.0947 13.8287 20.0687 26.4147 37.1881 45.3063 58.0940 65.1773 67.4600 76.8813 81.0733 99.1004 113.7566 123.0199 165.6506 171.4557 185.5550 197.6270 201.1607 208.9090 227.8871 238.2952 248.2870 259.5746 265.6490 269.3168 273.6381 277.1445 310.1169 312.2822 321.6482 333.6184 337.6015 342.5881 356.2234 361.0778 398.7157 405.3328 415.2369 445.8385 450.4088 477.2455 482.4158 502.9382 509.0714 520.2412 588.5434 608.9819 630.2722 681.7465 730.7892 743.1722 747.9212 759.8399 782.5791 814.1222 814.9475 818.2182 829.4063 849.8015 858.0312 862.5670 876.4619 904.2557 916.5970 919.7147 937.4276 952.2032 966.5626 977.2448 982.5008 983.3379 1000.8336 1004.7316 1009.9251 1017.7358 1028.2367 1037.3758 1039.8079 1073.0881 1078.4071 1094.1157 1098.7829 1102.8746 1114.4616 1122.2956 1135.4105 1159.4755 1176.5605 1181.4056 1182.2432 1192.3644 1202.2941 1223.4065 1233.8825 1235.8803 1250.2702 1251.6296 1264.4518 1286.1997 1296.9280 1298.1962 1304.4365 1307.4254 1318.1063 1332.1574 1339.8140 1343.3857 1355.4004 1357.8130 1366.2482 1387.8400 1397.0152 1410.2929 1417.4359 1420.1778 1423.6430 1427.5549 1431.1627 1435.1755 1443.4712 1444.0895 1456.3164 1464.5292 1467.0366 1470.6072 1471.5961 1472.8122 1474.6755 1479.7847 1482.7894 1483.1190 1492.7455 1498.9623 1500.2354 1503.3974 1555.6665 1590.3335 1618.8832 1643.7144 2936.5319 2961.6766 2985.6704 3003.8229 3011.6888 3013.7127 3016.8060 3019.8909 3024.8472 3026.8011 3027.8836 3028.7972 3049.0054 3057.1550 3066.2348 3077.8142 3080.0227 3082.2383 3133.7715 3134.3710 3134.5339 3135.4238 3139.6581 3139.8388 3143.2595 3145.0252 3147.6688 3151.3384 3155.4594 3165.8308 3166.4797 3166.5685 3578.6349 3592.3375
redmass: 4.4330 5.1807 4.7657 5.2753 4.9932 3.9476 3.1694 3.5971 4.3173 3.2445 2.2786 3.4614 4.5098 4.6569 2.7789 2.4865 2.3351 1.3938 2.7101 2.3660 1.1736 3.8260 1.5912 1.6545 1.3849 1.9741 1.5143 1.2717 2.8563 2.9436 3.0082 2.9142 3.3384 2.6338 2.3551 3.6546 2.7954 2.9961 3.1761 3.2345 2.1211 2.8467 2.7313 2.7787 2.7777 3.3030 2.8813 4.8057 6.9031 4.9037 2.6237 1.5895 3.2133 3.5550 2.8476 2.6507 1.4057 1.8868 1.8716 1.9290 1.7574 3.0112 2.4707 3.0475 3.0204 2.1300 2.5635 2.7454 1.8658 3.5095 3.6709 1.7035 3.0516 1.4286 2.8669 2.5251 2.4034 2.3217 2.1217 1.8805 2.2058 1.5519 1.3083 1.3532 1.3821 1.4537 1.5297 1.3219 1.5558 1.3610 1.3852 1.4417 1.1811 2.5981 1.6609 1.2481 1.3395 2.8116 1.2772 1.3972 1.3403 1.3212 1.2466 1.2907 1.3290 1.1984 1.3585 1.4748 1.4138 1.5435 1.2176 3.5175 1.2035 1.2197 3.1129 1.1617 1.1116 1.1520 1.1791 1.1390 1.1133 1.0928 1.0950 1.0766 1.0709 1.0889 1.0793 1.0523 1.0666 1.0581 1.0544 1.0735 1.0833 1.0750 1.0619 2.2941 6.2498 7.1334 6.3979 7.8087 1.0629 1.0629 1.0625 1.0650 1.0631 1.0969 1.0591 1.0917 1.0332 1.0324 1.0329 1.0334 1.0608 1.0613 1.1020 1.1013 1.0990 1.1036 1.0896 1.0893 1.1054 1.1066 1.1056 1.1057 1.1056 1.1054 1.1054 1.1050 1.0965 1.1059 1.1039 1.0970 1.0676 1.0676
irintensity: 5.1375 0.9410 4.1118 0.3166 2.2202 0.7950 5.7544 9.9144 3.2742 5.8254 5.4314 1.8726 1.0453 1.2876 0.5424 3.6132 1.9562 1.1601 18.7581 4.2817 1.0276 38.1989 60.6769 126.0857 50.1736 40.0812 8.4364 6.6431 11.7435 1.9430 15.1039 4.9408 7.5982 6.1195 0.7406 5.1383 0.2242 2.3999 5.7092 4.6242 2.7606 2.2778 1.5249 10.7620 2.7720 6.7597 11.1384 1.8245 2.0939 22.9765 0.3994 1.5444 6.3213 13.2347 21.5513 1.7542 15.4467 39.2543 32.6522 50.1340 55.2549 10.5635 3.5029 92.9516 38.6932 13.6181 25.5979 24.7139 17.6163 82.1942 46.9174 3.3087 6.7979 1.0895 16.5566 7.5868 1.0828 3.0007 3.1045 2.8902 35.1209 1.6733 6.7607 1.9210 8.4680 10.2796 6.1634 15.4408 26.9999 1.8036 1.5644 3.6712 58.5883 2.8187 68.3224 45.7054 2.9822 177.2122 14.7753 26.8048 2.1133 2.8482 5.9226 3.5901 6.2686 10.9075 14.3125 65.5901 5.9986 9.6843 7.8237 5.2318 5.1745 20.3501 35.1870 32.7983 17.1013 7.2156 34.9049 17.6657 7.2264 2.9482 32.1175 13.8748 44.2272 12.7569 4.1974 19.1007 13.5826 26.9352 38.3290 16.4338 9.9093 112.1917 67.6459 5.3009 124.9779 205.7361 66.7323 58.0184 76.4419 19.7730 47.4934 5.8822 2.2061 41.0503 10.3111 3.4301 2.7783 3.9155 8.1076 5.1877 9.1416 8.1102 19.1268 1.4302 4.9990 1.1171 5.5610 15.2711 2.8684 1.7078 2.6637 1.2518 6.8917 6.0340 4.4437 3.9881 5.6673 2.2387 3.1281 1.6757 36.0093 45.4889
temp: 298.150 k
press: 1.00000 atm
elementType: 8 8 8 8 7 7 6 6 6 6 6 6 6 6 6 6 6 6 6 6 6 6 6 6 6 6 1 1 1 1 1 1 1 1 1 1 1 1 1 1 1 1 1 1 1 1 1 1 1 1 1 1 1 1 1 1 1 1 1 1
symmnumber: 1
zpe: 1362130.2 jmol-1
zpe.correction: 0.518808 hartree
zpe.thermalcorrener: 0.548884 hartree
zpe.thermalcorrenthalpy: 0.549828 hartree
zpe.thermalcorrgfe: 0.453762 hartree
zpe.sumelectzpe: -1190.288367 hartree
zpe.sumelectthermal: -1190.258292 hartree
zpe.sumelectthermalent: -1190.257348 hartree
zpe.sumelectthermalfe: -1190.353414 hartree
dipole: -5.8720 0.7685 1.8492
dipole: 6.2041
quadrupole: 230.7648 -133.6909 -133.0776
quadrupole: -20.6381 -57.3089 -2.3556
quadrupole: 242.7660 -121.6897 -121.0763 -20.6381 -57.3089 -2.3556
hfenergy: -1190.8071755 hartree
pointgroup: C01 [X(C20H34N2O4)]
dipole: -2.3785144 0.2008949 0.5100792 debye
polarizability: 342.6626878|18.8907842|189.0642289|18.6615091|-7.4543816|214.9201324 unknown
InChI: InChI=1S/C20H34N2O4/c1-21(2,11-13-23)15-19(25)10-7-17-5-8-18(9-6-17)20(26)16-22(3,4)12-14-24/h5-6,8-9,23-24H,7,10-16H2,1-4H3
charge 2 multiplicity 1
60 atoms
O  -6.570679 2.851595 -2.273948
O  -4.413901 -0.95442 -1.562298
O  6.526025 3.517061 2.374842
O  4.342807 -0.463976 1.844225
N  -6.701968 -0.098445 0.041162
N  6.37289 0.465244 0.053433
C  -5.2557 -0.050646 0.561568
C  -6.912992 0.815865 -1.193678
C  4.899978 0.397448 -0.375505
C  6.604696 1.342332 1.322151
C  -7.083687 -1.535548 -0.355727
C  -7.627619 0.342084 1.180158
C  6.919298 -0.941971 0.334273
C  7.16465 1.058189 -1.117806
C  -4.148429 -0.470347 -0.435822
C  -6.779843 2.328659 -0.928585
C  -2.72114 -0.244811 0.053365
C  3.921529 -0.158026 0.689268
C  5.899348 2.718886 1.328076
C  -1.685579 -1.059155 -0.769203
C  2.500541 -0.321879 0.289599
C  -0.242126 -0.770155 -0.382228
C  1.994107 0.069187 -0.982474
C  1.613108 -0.929205 1.225853
C  0.64128 -0.150927 -1.306225
C  0.267748 -1.150176 0.890978
H  -5.05442 0.974417 0.919709
H  -5.207338 -0.718002 1.443128
H  -6.172223 0.518524 -1.950724
H  -7.918297 0.58493 -1.582535
H  4.596284 1.418379 -0.666726
H  4.863167 -0.233277 -1.282103
H  6.279184 0.737931 2.181381
H  7.693557 1.512946 1.376451
H  -8.160119 -1.554565 -0.584198
H  -6.871361 -2.207772 0.49065
H  -6.497867 -1.82757 -1.236776
H  -7.323111 1.333751 1.545893
H  -7.566399 -0.39184 1.998631
H  -8.658864 0.384674 0.798479
H  7.984207 -0.851828 0.597392
H  6.810067 -1.556486 -0.573413
H  6.358743 -1.379191 1.170574
H  6.807852 2.076087 -1.33217
H  7.031247 0.420025 -2.005048
H  8.229123 1.091317 -0.842095
H  -5.910136 2.566135 -0.276753
H  -7.693518 2.741485 -0.457143
H  -2.649528 -0.466434 1.136932
H  -2.505601 0.841855 -0.04266
H  6.082503 3.284502 0.397885
H  4.806331 2.617037 1.480627
H  -1.896759 -2.136918 -0.629689
H  -1.844934 -0.849599 -1.840306
H  2.637674 0.540295 -1.733932
H  2.009517 -1.235887 2.199121
H  0.268299 0.143422 -2.293414
H  -0.386783 -1.649693 1.614944
H  -6.838902 3.801839 -2.339449
H  6.124258 3.330149 3.260384
