program: Gaussian 09
title: 000116400
version: EM64L-G09RevD.01
frameworkgroup: C1[X(C17H20N2S)]
method: RPBEPBE
basis: SDD
operation: Freq
keyword: #p
keyword: freq=noraman
keyword: PBEPBE/SDD
title: #p freq=noraman PBEPBE/SDD
converged: YES YES NO NO
title: Mulliken charges:
elementType: S N N C C C C C C C C C C C C C C C C C H H H H H H H H H H H H H H H H H H H H
charge: 0.006193 -0.717357 -0.717182 0.589016 0.587825 0.380145 0.380128 0.132593 0.132659 -0.680306 -0.650847 -0.650569 0.374643 0.374351 -0.616584 -0.616274 -0.855163 -0.855262 -0.870505 -0.870452 0.267836 0.267781 0.259525 0.259483 0.228179 0.224740 0.242543 0.242558 0.228223 0.224709 0.229428 0.228062 0.261298 0.228972 0.228512 0.261302 0.322628 0.307363 0.307295 0.322512
chargesum: 0.00000
title: Mulliken charges with hydrogens summed into heavy atoms:
elementType: S N N C C C C C C C C C C C C C C C C C
charge: 0.006193 -0.087366 -0.087375 0.589016 0.587825 0.380145 0.380128 0.132593 0.132659 -0.680306 -0.383011 -0.382788 0.374643 0.374351 -0.357059 -0.356790 -0.159702 -0.159773 -0.151718 -0.151665
polarizability: 3.44098778e+02 6.05304391e-02 2.54005667e+02 -1.37784277e+01 3.16790791e-02 1.40611490e+02
1716.lowfreq: -7.5044 -1.9572 -0.0014 -0.0011 -0.0011 3.5111 28.6945 41.9731 50.2443
frequency: 28.0311 41.9130 50.2391 75.3377 110.4783 123.5367 150.6371 153.9235 162.8730 165.1905 180.4076 189.0778 215.3751 231.3862 236.9336 255.6543 281.4760 286.0467 311.9273 316.1639 320.4291 326.9077 330.5685 331.3162 372.8678 397.3039 411.1180 459.3393 476.8692 514.7682 524.0882 530.5794 542.9700 546.7278 555.8427 565.5521 620.6938 651.0284 695.7432 701.1594 733.9396 734.2619 767.8649 868.2006 874.3352 880.2395 890.4430 898.0210 918.4592 924.4257 982.3261 996.5021 1013.0991 1017.9278 1024.9436 1025.1846 1050.1947 1050.2865 1074.8784 1095.6795 1107.6794 1108.0143 1172.6126 1192.3696 1220.3378 1235.6007 1266.4933 1268.5533 1339.4889 1361.2984 1383.5838 1389.1088 1392.5430 1393.9389 1400.9151 1401.0771 1421.0665 1431.3313 1456.3887 1456.8374 1467.8200 1467.8680 1485.7281 1486.5177 1490.7138 1490.8003 1498.2560 1500.4427 1580.7219 1585.1494 1604.1177 1607.5094 1636.4676 1637.9079 2947.1943 2947.3561 2971.5896 2971.8272 3008.9946 3009.0786 3045.3574 3045.7847 3087.1469 3087.1851 3109.1440 3109.2362 3135.8376 3138.3975 3148.9097 3149.2410 3573.3544 3573.6128 3713.5538 3713.8909
redmass: 4.5722 3.9524 4.3346 4.7332 2.2674 1.9424 1.2511 1.4561 3.1844 1.8477 1.2049 1.4753 3.8065 3.1075 4.6886 3.4344 1.9446 1.8819 2.0616 1.9367 2.0546 2.3465 2.6013 2.6455 3.9963 1.1707 1.2268 3.7725 5.3004 4.9499 3.4141 4.9904 4.6710 3.6330 3.3931 3.8134 4.9753 4.9012 6.0624 3.8306 2.1840 2.5559 4.4911 1.4149 1.4785 3.8457 1.7740 1.7286 2.2987 2.0826 1.9452 1.6076 1.6283 1.5430 1.4457 1.4522 1.6172 1.6171 1.8349 2.0735 2.4553 2.3493 3.9297 4.8626 2.2431 1.7715 1.4349 1.3582 3.6232 4.8466 6.7584 2.8659 1.4136 1.7540 1.2137 1.2234 3.7422 3.8254 1.4236 1.3876 1.0468 1.0466 1.1317 1.1532 1.0473 1.0481 2.0727 2.2112 5.9576 6.0498 5.0917 4.9857 1.1997 1.2193 1.0420 1.0420 1.0382 1.0382 1.0968 1.0968 1.0974 1.0975 1.0974 1.0975 1.0921 1.0921 1.0911 1.0904 1.0915 1.0917 1.0449 1.0449 1.1034 1.1034
irintensity: 0.5058 0.0404 0.9654 1.2333 0.4701 4.1106 1.6176 0.7199 2.3370 2.3436 2.7296 0.0201 0.0968 4.5545 4.7997 0.7728 28.8857 62.7411 88.4927 42.7945 133.9052 47.7631 1.6711 0.5844 29.3277 54.9810 29.5203 0.5279 7.6407 0.2873 1.5257 0.3841 0.7683 1.7412 1.6450 3.6724 0.0011 7.5924 2.1899 0.1383 6.0280 0.1077 29.4410 28.2007 15.9562 23.6793 49.9222 0.3569 0.0416 1.7640 9.9130 0.0773 20.3204 5.8512 3.7902 10.2929 3.5363 1.7706 17.9500 22.4821 22.7206 30.3537 13.9693 56.6157 1.3694 85.6651 0.2272 14.5587 103.2964 232.5115 79.5541 0.0639 21.6387 19.5141 9.1301 2.6708 15.2597 85.8951 0.2578 0.0882 22.1454 25.8160 16.4573 17.2295 0.2107 0.1295 37.4169 14.7320 55.0162 85.7419 17.8161 1.5181 113.6775 259.6840 72.6847 34.8975 71.1984 19.3131 23.8486 24.6128 21.3325 21.9594 15.8472 19.4939 18.8857 12.4258 9.5434 8.1117 2.6949 0.0345 44.6926 52.3975 18.6793 20.3376
temp: 298.150 k
press: 1.00000 atm
elementType: 16 7 7 6 6 6 6 6 6 6 6 6 6 6 6 6 6 6 6 6 1 1 1 1 1 1 1 1 1 1 1 1 1 1 1 1 1 1 1 1
symmnumber: 1
zpe: 859454.9 jmol-1
zpe.correction: 0.327349 hartree
zpe.thermalcorrener: 0.348517 hartree
zpe.thermalcorrenthalpy: 0.349461 hartree
zpe.thermalcorrgfe: 0.278299 hartree
zpe.sumelectzpe: -1165.951325 hartree
zpe.sumelectthermal: -1165.930158 hartree
zpe.sumelectthermalent: -1165.929213 hartree
zpe.sumelectthermalfe: -1166.000376 hartree
dipole: -0.0067 -7.1900 0.0094
dipole: 7.1900
quadrupole: -97.4722 -122.3128 -123.4076
quadrupole: 0.0286 1.6041 -0.0237
quadrupole: 16.9254 -7.9153 -9.0101 0.0286 1.6041 -0.0237
hfenergy: -1166.2786743 hartree
pointgroup: C01 [X(C17H20N2S1)]
dipole: -0.0886106 0.1476459 -2.8235246 debye
polarizability: 331.6413369|50.5964177|153.4594189|0.4008629|-6.9782998|253.6151788 unknown
InChI: InChI=1S/C17H20N2S/c1-9-5-13(7-15(18)11(9)3)17(20)14-6-10(2)12(4)16(19)8-14/h5-8H,18-19H2,1-4H3
charge 0 multiplicity 1
40 atoms
S  0.106058 -0.187326 3.094358
N  -2.979084 1.083528 -2.366951
N  2.838634 -0.853257 -2.650198
C  -1.238621 -0.259119 0.6580
C  1.292473 0.157001 0.60066
C  -3.508167 -1.230573 0.531168
C  3.554459 1.140785 0.439399
C  -3.766705 -0.509843 -0.671952
C  3.736043 0.55189 -0.846683
C  0.050643 -0.092003 1.381544
C  -2.263941 -1.092509 1.184008
C  2.351848 0.931256 1.148857
C  -2.746685 0.347568 -1.19809
C  2.681236 -0.245358 -1.398127
C  -1.493693 0.454842 -0.542243
C  1.469543 -0.423134 -0.682758
C  -4.55693 -2.153013 1.134923
C  4.642117 1.995612 1.07346
C  -5.087761 -0.606658 -1.413604
C  5.01103 0.727385 -1.651704
H  -2.066465 -1.630739 2.116341
H  2.214797 1.365061 2.144335
H  -0.729926 1.129354 -0.944742
H  0.67874 -1.050829 -1.1081
H  -5.484903 -1.607728 1.392734
H  -4.839132 -2.968954 0.442177
H  -4.176894 -2.61714 2.060036
H  4.318878 2.3608 2.062308
H  5.580332 1.42676 1.218872
H  4.888895 2.879468 0.454335
H  -5.60484 0.375026 -1.451691
H  -4.940401 -0.940543 -2.461473
H  -5.779982 -1.317582 -0.938783
H  5.516279 -0.245124 -1.829324
H  4.804662 1.176121 -2.645273
H  5.736567 1.379266 -1.143115
H  -3.88368 1.073679 -2.825443
H  -2.266205 1.712676 -2.723712
H  2.102898 -1.443535 -3.026483
H  3.714882 -0.796407 -3.157766
