program: Gaussian 09
title: 000116386
version: EM64L-G09RevD.01
frameworkgroup: C1[X(C10H16N4O2)]
method: RPBEPBE
basis: SDD
operation: Freq
keyword: #p
keyword: freq=noraman
keyword: PBEPBE/SDD
title: #p freq=noraman PBEPBE/SDD
converged: YES YES NO NO
title: Mulliken charges:
elementType: O O N N N N C C C C C C C C C C H H H H H H H H H H H H H H H H
charge: -0.487434 -0.487434 -0.113715 -0.113700 -0.106609 -0.106624 -0.418764 -0.418862 0.062157 0.062071 0.016193 0.016285 -0.800807 -0.800805 -0.804536 -0.804517 0.177002 0.177131 0.176819 0.177309 0.189739 0.189782 0.276977 0.189813 0.189684 0.276995 0.195658 0.250217 0.197050 0.195636 0.250223 0.197066
chargesum: -2.00000
title: Mulliken charges with hydrogens summed into heavy atoms:
elementType: O O N N N N C C C C C C C C C C
charge: -0.487434 -0.487434 -0.113715 -0.113700 -0.106609 -0.106624 -0.064631 -0.064734 0.062157 0.062071 0.016193 0.016285 -0.144308 -0.144313 -0.161611 -0.161592
polarizability: 3.32477607e+02 -9.68096021e+00 1.47862390e+02 -1.34671199e-01 -1.02135115e-02 9.06775294e+01
1716.lowfreq: 0.0005 0.0007 0.0009 3.9393 5.0540 12.3154 21.1683 31.1854 43.6005
frequency: 21.1662 31.1852 43.6004 48.9956 58.7336 59.5467 90.0250 96.7826 123.4897 145.4262 170.2849 183.4103 199.4859 217.7904 237.2899 268.0099 281.7821 287.6044 311.3120 323.9689 354.0960 429.1600 437.0607 441.0630 441.5227 484.4338 548.6464 582.4683 582.8065 638.9479 666.7312 761.2409 765.8383 775.5210 910.3635 933.1023 957.8548 961.7792 1012.8959 1013.9311 1025.0733 1025.4616 1030.4959 1031.3204 1046.5658 1080.1709 1100.2976 1121.0756 1145.8981 1150.9422 1154.6567 1267.7219 1276.9707 1326.0018 1330.4329 1335.9794 1339.4724 1346.4710 1362.9184 1366.1801 1377.6751 1382.5857 1425.3050 1438.2765 1445.7302 1446.6258 1454.5180 1454.6628 1460.9893 1461.7355 1484.8648 1485.4849 1527.7923 1533.3529 2876.1311 2880.2165 2908.3742 2940.5906 2944.7380 2944.9605 2946.2487 2946.4620 3009.1321 3009.1936 3022.1458 3022.2750 3077.2319 3077.3098 3090.8814 3090.9095
redmass: 3.4330 5.8174 5.7825 2.5111 1.0365 1.1036 2.8912 3.5955 5.0623 2.7744 1.8444 5.7953 1.1669 1.5028 5.4403 4.0577 3.0437 4.6670 4.3628 3.4668 2.8916 3.8893 6.4585 4.5669 4.5050 4.4260 4.9783 3.0514 3.0564 3.9935 3.4636 3.8440 1.1728 3.6970 3.4286 3.3401 1.7289 1.7678 1.5379 3.0171 1.4665 1.5132 3.4350 1.5449 1.6138 3.2346 2.5973 2.9129 1.1230 10.3124 9.1703 1.1330 1.3110 1.4279 1.2786 1.2675 1.2330 1.4224 7.1811 6.5050 3.7141 3.0791 1.1097 1.1728 1.0803 1.0636 1.0720 1.0703 1.2299 1.2429 1.0522 1.0525 4.9668 5.3859 1.0553 1.0556 1.0967 1.1057 1.0349 1.0349 1.0349 1.0349 1.0957 1.0957 1.0964 1.0965 1.1001 1.1001 1.0988 1.0988
irintensity: 0.2958 7.7170 6.3027 0.0105 0.0150 0.0010 0.0000 14.6990 0.0000 0.0006 3.3755 0.0001 0.0006 3.4806 41.4841 0.0003 12.7588 0.0042 5.3964 0.0001 3.7222 0.0006 71.8080 0.0942 0.2645 7.4211 0.0003 2.8544 0.0086 0.0000 2.9404 14.8210 1.9535 0.0008 2.6997 0.0001 19.0344 0.0001 0.0021 0.0001 2.1864 0.0273 13.4954 5.4964 0.0028 0.0005 184.3961 0.0010 1.7262 635.0905 0.0254 0.0484 194.4033 0.0088 32.0049 0.0036 156.7372 0.0015 278.5626 0.0306 3.1663 0.0021 0.0003 117.5242 0.1478 17.6433 1.6746 11.3586 5.3138 0.5495 25.9169 0.0032 751.7129 0.0026 0.0238 190.2209 0.0882 142.4339 2.0624 266.8900 16.7596 0.1703 0.4411 113.9493 17.5540 79.2180 16.3207 2.7150 2.9649 8.7135
temp: 298.150 k
press: 1.00000 atm
elementType: 8 8 7 7 7 7 6 6 6 6 6 6 6 6 6 6 1 1 1 1 1 1 1 1 1 1 1 1 1 1 1 1
symmnumber: 1
zpe: 651545.2 jmol-1
zpe.correction: 0.248160 hartree
zpe.thermalcorrener: 0.267335 hartree
zpe.thermalcorrenthalpy: 0.268279 hartree
zpe.thermalcorrgfe: 0.198058 hartree
zpe.sumelectzpe: -758.772935 hartree
zpe.sumelectthermal: -758.753761 hartree
zpe.sumelectthermalent: -758.752816 hartree
zpe.sumelectthermalfe: -758.823038 hartree
dipole: 0.0011 0.0013 -0.0016
dipole: 0.0023
quadrupole: -392.1816 -111.2359 -101.4310
quadrupole: -1.2869 0.0215 0.0054
quadrupole: -190.5654 90.3803 100.1852 -1.2869 0.0215 0.0054
hfenergy: -759.021096 hartree
pointgroup: C01 [X(C10H16N4O2)]
dipole: -0.0003988 -0.0006253 0.0005502 debye
polarizability: 332.9805647|0.1604429|90.6776616|-0.7800516|0.0767071|147.3592998 unknown
InChI: InChI=1S/C10H16N4O2/c1-7(9(3)13-15)11-5-6-12-8(2)10(4)14-16/h5-6H2,1-4H3
charge -2 multiplicity 1
32 atoms
O  6.615214 0.215051 -0.221803
O  -6.615009 0.211986 0.220983
N  1.885111 0.212827 0.127545
N  -1.884976 0.216567 -0.126822
N  5.407348 0.211866 -0.843486
N  -5.407391 0.212668 0.84313
C  0.558832 0.209587 -0.53063
C  -0.558679 0.217322 0.531268
C  2.982027 0.21174 -0.63767
C  -2.982148 0.215264 0.638052
C  4.309223 0.214643 -0.022642
C  -4.309071 0.214387 0.022574
C  2.925735 0.207204 -2.172495
C  -2.926645 0.213254 2.172923
C  4.454573 0.218708 1.486901
C  -4.453891 0.21352 -1.487046
H  0.405202 -0.682333 -1.183571
H  0.406792 1.092429 -1.195926
H  -0.406726 -0.666542 1.195426
H  -0.404683 1.108217 1.185299
H  2.374144 -0.682354 -2.538864
H  2.378912 1.097401 -2.544609
H  3.957581 0.203993 -2.561393
H  -2.379277 -0.678246 2.541003
H  -2.376025 1.10152 2.543889
H  -3.958699 0.214358 2.561302
H  5.01337 1.117521 1.819437
H  3.451899 0.194137 1.944139
H  5.061595 -0.649288 1.815959
H  -5.013331 1.110782 -1.822681
H  -3.451044 0.188458 -1.943885
H  -5.060062 -0.656047 -1.813509
