program: Gaussian 09
title: 000014369
version: EM64L-G09RevD.01
frameworkgroup: C1[X(C15H9BrO2)]
method: RPBEPBE
basis: SDD
operation: Freq
keyword: #p
keyword: freq=noraman
keyword: PBEPBE/SDD
title: #p freq=noraman PBEPBE/SDD
converged: YES YES NO NO
title: Mulliken charges:
elementType: Br O O C C C C C C C C C C C C C C C H H H H H H H H H
charge: 0.004618 -0.155373 -0.163973 -0.452036 -0.083285 0.011148 0.264799 0.215940 0.470726 -0.366290 -0.362388 -0.344502 -0.374400 -0.207860 -0.205688 -0.196259 -0.188867 -0.214507 0.285516 0.281666 0.280773 0.257311 0.253987 0.243758 0.243572 0.251335 0.250280
chargesum: 0.00000
title: Mulliken charges with hydrogens summed into heavy atoms:
elementType: Br O O C C C C C C C C C C C C C C C
charge: 0.004618 -0.155373 -0.163973 -0.166520 -0.083285 0.011148 0.264799 0.215940 0.470726 -0.084624 -0.081615 -0.087191 -0.120414 0.035898 0.037884 0.055076 0.061413 -0.214507
polarizability: 2.77135868e+02 -7.67897987e+00 1.64606502e+02 -1.68789225e+01 5.67443707e+00 1.04198876e+02
1716.lowfreq: -7.2140 -2.9560 -0.0002 0.0004 0.0006 2.3098 17.3086 21.8802 50.4518
frequency: 17.0621 21.6780 50.4509 100.5117 124.0061 137.8419 169.9078 188.2649 238.1648 261.8899 313.9674 324.2287 344.3615 400.3503 404.1753 435.0186 473.5925 508.5880 523.8771 526.4898 600.7192 612.9243 626.1828 682.5831 689.5964 710.6633 761.1899 769.8559 793.9537 810.4631 827.9978 840.3355 869.7797 910.8495 951.1456 967.5382 975.6868 986.1978 996.1598 1006.8335 1014.8600 1053.7616 1068.2123 1081.6656 1116.2752 1161.9192 1171.0185 1181.6002 1189.6469 1197.4591 1224.8820 1262.7188 1281.1158 1302.5200 1366.9452 1391.5936 1409.0475 1452.0934 1454.1694 1474.4944 1578.4177 1589.5757 1595.4415 1599.8754 1628.8830 1654.9546 2966.6108 3139.6564 3149.4996 3152.9750 3156.6934 3164.3473 3172.3863 3173.8801 3177.0197
redmass: 7.1281 4.2844 9.1310 7.4681 5.7906 10.7256 6.4602 9.1565 7.0967 6.6896 6.0282 10.1634 6.2291 3.7186 2.8640 4.5451 4.1556 3.3899 7.7381 10.7397 3.7540 7.4876 6.5406 4.9709 6.1489 4.2835 1.7797 3.9212 2.4414 1.8855 1.2549 4.3653 3.2901 1.4534 1.4303 1.4316 4.4272 1.4328 5.0131 2.5780 1.3642 3.4184 2.2929 2.4240 1.4089 1.4914 1.1181 1.3739 1.8375 1.1534 2.9462 4.4982 1.6582 1.2775 6.6808 2.8510 7.9412 2.5114 2.5626 2.3375 7.4140 7.5599 6.1420 7.4250 10.4167 12.8233 1.0798 1.0866 1.0892 1.0903 1.0883 1.0957 1.0963 1.1005 1.0974
irintensity: 2.2929 0.4340 1.0864 1.9461 0.2022 3.6481 0.0899 0.3893 0.2700 2.8929 2.3002 18.0576 1.2609 8.5932 0.5694 0.6596 4.0124 41.4255 0.4808 1.8683 1.2139 9.4450 0.8232 7.9743 15.2479 1.1799 52.5447 0.4800 48.0627 53.8335 0.3597 6.2405 16.9619 0.0395 2.7828 0.5807 8.0617 4.8707 59.8550 9.5741 0.0278 43.7017 7.4558 1.3291 6.9392 12.9057 21.8993 0.4617 6.8272 3.7202 28.9506 307.4156 8.9350 1.6797 0.4070 13.8656 12.0691 1.1313 1.1759 123.5944 7.6500 146.2926 4.0492 3.0443 149.2259 74.7783 7.7182 1.6887 3.3608 3.6601 2.1008 4.0237 6.8931 24.7320 0.6613
temp: 298.150 k
press: 1.00000 atm
elementType: 35 8 8 6 6 6 6 6 6 6 6 6 6 6 6 6 6 6 1 1 1 1 1 1 1 1 1
symmnumber: 1
zpe: 506686.1 jmol-1
zpe.correction: 0.192987 hartree
zpe.thermalcorrener: 0.207603 hartree
zpe.thermalcorrenthalpy: 0.208547 hartree
zpe.thermalcorrgfe: 0.147998 hartree
zpe.sumelectzpe: -739.684461 hartree
zpe.sumelectthermal: -739.669844 hartree
zpe.sumelectthermalent: -739.668900 hartree
zpe.sumelectthermalfe: -739.729450 hartree
dipole: 5.5185 0.1341 -1.0753
dipole: 5.6239
quadrupole: -90.6807 -118.0482 -110.7462
quadrupole: -1.1389 -9.1014 6.4513
quadrupole: 15.8110 -11.5565 -4.2545 -1.1389 -9.1014 6.4513
hfenergy: -739.8774477 hartree
pointgroup: C01 [X(C15H9Br1O2)]
dipole: 2.2004445 0.0654246 -0.2222545 debye
polarizability: 278.8526595|-7.5209577|164.5068442|-0.8501737|5.0113376|102.581742 unknown
InChI: InChI=1S/C15H9BrO2/c16-10-7-5-9(6-8-10)13-14(17)11-3-1-2-4-12(11)15(13)18/h1-8,13H
charge 0 multiplicity 1
27 atoms
Br -5.926478 -0.139794 -1.242033
O  0.626369 -2.335635 1.119217
O  0.417018 2.449672 0.271534
C  -0.020206 0.082208 0.984933
C  0.896814 -1.151007 0.794659
C  0.796845 1.25633 0.36053
C  2.172889 -0.684475 0.175256
C  2.11063 0.708523 -0.086446
C  -1.448348 -0.021911 0.45139
C  3.321887 -1.436407 -0.148226
C  3.194693 1.389135 -0.679763
C  -2.365568 1.014368 0.762272
C  -1.880109 -1.094932 -0.365456
C  4.409798 -0.759023 -0.743982
C  4.346642 0.638722 -1.007656
C  -3.686809 0.989491 0.266212
C  -3.200444 -1.13474 -0.869107
C  -4.08789 -0.089625 -0.547294
H  -0.076153 0.28278 2.076735
H  3.356904 -2.510445 0.059396
H  3.13273 2.463961 -0.876616
H  -2.043345 1.858692 1.38027
H  -1.203093 -1.9214 -0.599575
H  5.316692 -1.31292 -1.009634
H  5.205742 1.134884 -1.471995
H  -4.385249 1.794819 0.510001
H  -3.527361 -1.969673 -1.495223
