program: Gaussian 09
title: 000116366
version: EM64L-G09RevD.01
frameworkgroup: C1[X(C11H9Br3O4)]
method: RPBEPBE
basis: SDD
operation: Freq
keyword: #p
keyword: freq=noraman
keyword: PBEPBE/SDD
title: #p freq=noraman PBEPBE/SDD
converged: YES YES NO NO
title: Mulliken charges:
elementType: Br Br Br O O O O C C C C C C C C C C C H H H H H H H H H
charge: 0.056752 0.056837 0.077039 -0.287501 -0.287505 -0.178079 -0.178075 0.690137 0.740061 0.740133 -0.683418 -0.683054 -0.620398 -0.808134 0.266506 0.266502 -0.744388 -0.744394 0.248419 0.248513 0.267953 0.262932 0.252265 0.262847 0.262923 0.252267 0.262860
chargesum: 0.00000
title: Mulliken charges with hydrogens summed into heavy atoms:
elementType: Br Br Br O O O O C C C C C C C C C C C
charge: 0.056752 0.056837 0.077039 -0.287501 -0.287505 -0.178079 -0.178075 0.690137 0.740061 0.740133 -0.683418 -0.683054 -0.620398 -0.043249 0.266506 0.266502 0.033656 0.033656
polarizability: 2.42396210e+02 2.65432892e-03 2.12727972e+02 1.01449948e-03 -5.08460346e+00 1.04182096e+02
1716.lowfreq: -96.4199 -5.1425 -2.9054 -0.0008 -0.0006 -0.0005 5.0743 27.3336 29.5826
frequency: -96.4119 27.3206 29.5820 38.8120 42.2777 55.4850 56.4177 80.4947 87.5698 88.6789 90.5174 114.3723 128.8035 136.4232 219.7808 226.4426 230.6378 247.5244 256.3402 299.8964 326.3633 334.1505 359.9031 393.8799 428.0566 532.4248 536.8113 543.9023 559.3764 576.4937 600.7103 647.4166 648.9687 671.5816 710.4963 780.4276 780.8542 822.4589 976.9792 979.3267 988.7305 997.6304 1037.6807 1038.3131 1041.1076 1041.1496 1044.2680 1146.7264 1157.5318 1300.5273 1331.8834 1349.0256 1373.5426 1383.7756 1384.1611 1403.8203 1450.5940 1450.6879 1451.4128 1451.5959 1463.4312 1468.2447 1542.2566 1557.3075 1702.2976 1705.8836 2992.9159 3010.1411 3010.2071 3082.6118 3097.7624 3097.8130 3120.5902 3147.3550 3147.4014
redmass: 1.0821 10.6074 8.5567 10.5086 7.7893 1.9820 2.0601 5.8842 1.3794 1.3678 5.3217 16.8275 16.5288 32.2399 16.8656 10.4635 7.5972 6.4213 7.2171 5.0291 2.8334 7.7519 9.1811 5.7902 4.1072 4.6393 3.1138 3.2406 8.1725 6.5618 6.0979 8.1653 7.7481 7.7360 8.6729 8.0921 7.3853 8.6054 2.4193 2.4586 2.9512 6.3495 2.2526 1.5285 1.7178 1.6399 6.7883 2.7780 3.0696 10.5163 8.4162 8.2068 8.2763 1.2442 1.2631 1.2074 1.0466 1.0469 1.0540 1.0538 1.1224 1.0671 7.6514 10.6127 10.6593 10.6705 1.0424 1.0367 1.0367 1.0909 1.0972 1.0972 1.0998 1.1014 1.1014
irintensity: 0.7263 0.0304 0.1048 0.2228 1.0543 4.7024 2.9752 0.2627 0.5745 0.4644 4.0261 0.4001 0.1232 0.1970 0.9801 0.5405 1.8181 1.4015 2.7667 3.6620 0.3647 0.1463 0.4551 7.4341 8.1572 9.3340 1.1032 3.8445 4.4521 3.0306 0.6075 0.4813 16.2289 26.4390 84.4306 96.7369 56.1749 79.4885 51.3877 40.2450 81.7791 52.9907 205.9820 9.6271 4.1667 2.4327 28.6822 419.2798 307.8490 19.7942 17.8161 170.2792 117.4889 78.9661 21.6273 4.4032 11.8233 23.0246 0.5701 47.7601 30.0570 20.9362 3.6834 3.8571 2.8023 312.1415 8.6731 0.4789 0.4859 10.2241 3.2864 3.8257 3.9184 7.0371 9.4693
temp: 298.150 k
press: 1.00000 atm
elementType: 35 35 35 8 8 8 8 6 6 6 6 6 6 6 6 6 6 6 1 1 1 1 1 1 1 1 1
symmnumber: 1
zpe: 458399.1 jmol-1
zpe.correction: 0.174595 hartree
zpe.thermalcorrener: 0.194627 hartree
zpe.thermalcorrenthalpy: 0.195571 hartree
zpe.thermalcorrgfe: 0.120740 hartree
zpe.sumelectzpe: -764.518188 hartree
zpe.sumelectthermal: -764.498156 hartree
zpe.sumelectthermalent: -764.497212 hartree
zpe.sumelectthermalfe: -764.572043 hartree
dipole: -0.0005 0.1763 -2.3981
dipole: 2.4046
quadrupole: -107.8223 -116.7148 -145.2154
quadrupole: 0.0053 0.0005 -3.4934
quadrupole: 15.4285 6.5361 -21.9646 0.0053 0.0005 -3.4934
hfenergy: -764.692783 hartree
pointgroup: C01 [X(C11H9Br3O4)]
dipole: 0.0001677 0.0185737 -0.9458549 debye
polarizability: 242.3962096|0.0020275|210.8510189|-0.0066985|15.0354818|106.059049 unknown
InChI: InChI=1S/C11H9Br3O4/c1-4-7(12)10(17-5(2)15)9(14)11(8(4)13)18-6(3)16/h1-3H3
charge 0 multiplicity 1
27 atoms
Br 2.937542 2.269668 0.083784
Br -2.93682 2.271228 0.084379
Br -0.000962 -2.598901 -0.888383
O  -2.438532 -0.676952 -0.60713
O  2.437498 -0.678229 -0.607527
O  -2.679424 -1.196354 1.674366
O  2.679411 -1.196203 1.674185
C  0.000257 2.124273 0.029008
C  -1.220502 -0.002282 -0.381685
C  1.219879 -0.002883 -0.381871
C  1.206679 1.385665 -0.112846
C  -1.206541 1.386235 -0.112658
C  -0.00049 -0.698304 -0.517697
C  0.000412 3.607737 0.324439
C  -3.122182 -1.263359 0.520551
C  3.121625 -1.263982 0.520207
C  -4.3874 -1.916091 0.02959
C  4.387101 -1.916206 0.029231
H  0.896769 4.09676 -0.086492
H  -0.893796 4.097578 -0.09026
H  -0.001888 3.783268 1.417516
H  -4.145843 -2.685385 -0.723946
H  -4.922352 -2.371703 0.87455
H  -5.028659 -1.164795 -0.462885
H  4.146938 -2.679901 -0.730324
H  4.918552 -2.377938 0.873076
H  5.031426 -1.162646 -0.455878
