program: Gaussian 09
title: 000116284
version: EM64L-G09RevD.01
frameworkgroup: C1[X(C13H21N2O2)]
method: RPBEPBE
basis: SDD
operation: Freq
keyword: #p
keyword: freq=noraman
keyword: PBEPBE/SDD
title: #p freq=noraman PBEPBE/SDD
converged: YES YES NO NO
title: Mulliken charges:
elementType: O O N N C C C C C C C C C C C C C H H H H H H H H H H H H H H H H H H H H H
charge: -0.221122 -0.221319 -0.073504 -0.073966 -0.363000 -0.375103 -0.374407 -0.362287 -0.292551 -0.290504 -0.290766 -0.293015 -0.076807 -0.076248 -0.258300 -0.258584 -0.090944 0.228122 0.263428 0.265482 0.224595 0.265245 0.224607 0.227992 0.263277 0.255040 0.209633 0.209029 0.253318 0.208953 0.253200 0.254828 0.209826 0.241521 0.241457 0.239724 0.239774 0.213377
chargesum: 1.00000
title: Mulliken charges with hydrogens summed into heavy atoms:
elementType: O O N N C C C C C C C C C C C C C
charge: -0.221122 -0.221319 -0.073504 -0.073966 0.128550 0.114974 0.115445 0.128982 0.172122 0.171842 0.171387 0.171639 0.164714 0.165210 -0.018576 -0.018810 0.122433
polarizability: 4.58607473e+02 -4.75054612e-02 1.43242407e+02 1.99482391e+01 -3.03976584e-02 1.02661242e+02
1716.lowfreq: -17.0060 -7.2510 -5.0040 -0.0009 -0.0006 0.0004 20.4833 25.4086 40.5802
frequency: 15.8594 24.9875 40.5757 42.6373 82.2862 123.3080 179.5638 184.6744 187.4992 195.8998 228.6124 286.9659 308.2655 313.5425 356.4978 367.7508 385.3267 418.4894 435.1507 442.1195 460.1545 461.1055 473.5611 548.3584 585.2530 608.5221 628.5838 774.2439 784.9972 811.2374 811.6944 824.1699 825.4932 836.4216 881.3281 894.9482 900.8472 903.3342 936.0846 987.9668 991.0872 997.9258 1006.5744 1008.8499 1047.5725 1047.7227 1069.3164 1069.8097 1100.1660 1101.7844 1121.2389 1127.6515 1190.0746 1192.4255 1197.0517 1220.4170 1231.7705 1236.3983 1246.4077 1263.3013 1272.1843 1275.9852 1279.2600 1289.3367 1295.4413 1325.5293 1326.7014 1339.6623 1340.4301 1341.9560 1342.4168 1360.5701 1368.7192 1370.2790 1414.8061 1440.0649 1445.7163 1447.9444 1452.4914 1452.9870 1455.0429 1459.3991 1460.1216 1460.7389 1574.1465 1618.5572 1652.3431 2966.7547 2966.8161 2969.4723 2969.6585 3003.8111 3005.1254 3012.4247 3013.6891 3078.7932 3083.8807 3084.5756 3103.3961 3103.5898 3105.9317 3106.0886 3110.4780 3111.1862 3117.3022 3117.6008 3141.9791 3144.9504
redmass: 4.8717 3.4316 4.8244 3.8818 4.5416 3.9822 4.2864 1.7579 3.3629 2.9966 1.9152 3.0267 2.6955 2.8449 2.0776 5.4502 2.1141 2.0731 3.1097 2.6478 4.6969 3.0286 3.0206 3.3652 3.2559 2.0182 2.2294 3.9927 3.9687 3.5254 3.3482 1.6852 1.7070 1.4805 1.9252 1.4122 2.4589 2.2259 1.2718 2.6918 2.7549 1.2177 2.1645 2.2930 2.3167 2.2521 3.5768 3.6989 2.2050 2.1823 3.9348 3.4652 1.2816 1.0662 1.3580 1.4576 1.4756 1.1507 1.2945 1.3817 1.2342 1.2003 2.6171 1.2298 1.5498 1.2474 1.2537 1.2038 1.2496 1.2865 1.2399 1.4876 1.2623 1.2855 1.5145 1.5969 1.0926 1.2325 1.0925 1.1217 1.1005 1.1339 1.0944 1.1536 5.3417 4.2557 5.5367 1.0687 1.0687 1.0683 1.0683 1.0610 1.0608 1.0646 1.0646 1.0905 1.1029 1.1031 1.0960 1.0961 1.0983 1.0984 1.0992 1.0992 1.0916 1.0919 1.0901 1.0883
irintensity: 1.5599 0.1333 0.5859 0.3398 5.7262 0.6701 1.3474 0.1998 0.2516 3.5087 0.0056 32.8452 0.0687 0.9895 0.0194 2.2365 8.4625 0.0715 0.4001 1.4962 0.0809 0.3174 2.1881 23.5879 0.9688 2.3122 58.1236 0.1401 4.1655 10.7814 53.8549 0.9774 13.4521 0.0190 30.4415 8.6301 2.6402 9.4117 0.1376 81.0211 5.0278 67.9076 144.2326 1.6990 21.3457 62.3097 41.8161 34.6566 1.5336 0.3010 0.5521 22.6353 24.4818 2.6361 25.5455 3.0630 29.2820 163.3654 259.9594 208.1012 0.5955 121.1509 18.0507 0.1189 2.6256 0.3814 17.9910 6.0733 3.1808 2.8479 4.6671 0.1603 17.1310 0.3548 104.7603 3.7119 20.3014 25.8362 36.8777 1.5866 189.8528 3.1058 16.0235 1.5064 410.0088 2434.7233 0.0300 19.1222 29.6939 93.0243 27.2642 29.4266 25.5241 27.2548 21.6060 6.9659 13.0498 13.1559 13.1724 15.1604 26.0436 9.5713 11.7711 10.4580 0.6403 5.5343 2.5465 15.2800
temp: 298.150 k
press: 1.00000 atm
elementType: 8 8 7 7 6 6 6 6 6 6 6 6 6 6 6 6 6 1 1 1 1 1 1 1 1 1 1 1 1 1 1 1 1 1 1 1 1 1
symmnumber: 1
zpe: 862544.6 jmol-1
zpe.correction: 0.328526 hartree
zpe.thermalcorrener: 0.345220 hartree
zpe.thermalcorrenthalpy: 0.346164 hartree
zpe.thermalcorrgfe: 0.281610 hartree
zpe.sumelectzpe: -766.338599 hartree
zpe.sumelectthermal: -766.321905 hartree
zpe.sumelectthermalent: -766.320961 hartree
zpe.sumelectthermalfe: -766.385514 hartree
dipole: -0.0232 -2.1542 -0.0351
dipole: 2.1546
quadrupole: -40.3644 -78.3657 -99.6079
quadrupole: 0.0002 5.6345 -0.0802
quadrupole: 32.4149 -5.5864 -26.8286 0.0002 5.6345 -0.0802
hfenergy: -766.6671247 hartree
pointgroup: C01 [X(C13H21N2O2)]
dipole: 0.0182554 0.8388463 0.1206784 debye
polarizability: 458.7744378|-0.5238254|142.184693|-18.3476764|6.598979|103.5519909 unknown
InChI: InChI=1S/C13H21N2O2/c1(2-4-14-6-10-16-11-7-14)3-5-15-8-12-17-13-9-15/h1-5H,6-13H2
charge 1 multiplicity 1
38 atoms
O  6.339653 -0.668767 0.254872
O  -6.379595 -0.429349 -0.37074
N  3.692284 0.257091 -0.392511
N  -3.69924 0.198397 0.472083
C  4.855443 1.187695 -0.426633
C  4.069777 -1.16425 -0.613222
C  -4.105694 -1.213018 0.23911
C  -4.83933 1.092052 0.821965
C  5.943652 0.710579 0.562238
C  5.187337 -1.567113 0.379597
C  -5.251812 -1.262009 -0.800591
C  -5.955858 0.969555 -0.239373
C  2.43117 0.700272 -0.18176
C  -2.428789 0.659559 0.40301
C  1.238563 -0.049864 -0.151855
C  -1.252691 -0.068174 0.133171
C  -0.000099 0.582123 0.092502
H  4.519792 2.208753 -0.176814
H  5.271842 1.189651 -1.451846
H  4.445472 -1.267008 -1.648796
H  3.194401 -1.819301 -0.488456
H  -4.461507 -1.635626 1.197836
H  -3.24841 -1.80665 -0.112678
H  -4.482915 2.133664 0.897178
H  -5.238557 0.779876 1.80579
H  6.855014 1.31845 0.452423
H  5.573849 0.782328 1.607092
H  4.797919 -1.553901 1.419705
H  5.563314 -2.573998 0.140803
H  -4.881664 -0.928417 -1.793237
H  -5.647371 -2.286322 -0.88149
H  -6.84993 1.527728 0.078875
H  -5.604477 1.3603 -1.217852
H  2.355093 1.784445 -0.023422
H  -2.32964 1.736963 0.591772
H  1.248773 -1.131525 -0.324714
H  -1.286175 -1.14952 -0.038835
H  0.011807 1.670632 0.266404
