program: Gaussian 09
title: 000014356
version: EM64L-G09RevD.01
frameworkgroup: C1[X(C11H13Cl2NO2)]
method: RPBEPBE
basis: SDD
operation: Freq
keyword: #p
keyword: freq=noraman
keyword: PBEPBE/SDD
title: #p freq=noraman PBEPBE/SDD
converged: YES YES NO NO
title: Mulliken charges:
elementType: Cl Cl O O N C C C C C C C C C C C H H H H H H H H H H H H H
charge: -0.049871 -0.049341 -0.448908 -0.262044 -0.166632 -0.391740 -0.391631 0.460526 -0.348600 -0.345917 -0.584043 -0.583791 -0.384450 -0.352098 0.261410 0.100832 0.251278 0.253041 0.251042 0.253406 0.237326 0.236346 0.294248 0.269994 0.294265 0.269681 0.270350 0.273339 0.381983
chargesum: 0.00000
title: Mulliken charges with hydrogens summed into heavy atoms:
elementType: Cl Cl O O N C C C C C C C C C C C
charge: -0.049871 -0.049341 -0.066925 -0.262044 -0.166632 0.112578 0.112816 0.460526 -0.111274 -0.109572 -0.019802 -0.019844 -0.114100 -0.078758 0.261410 0.100832
polarizability: 2.48407127e+02 2.11785791e+00 1.68980529e+02 -4.18180757e-01 -1.90291604e+01 8.42578252e+01
1716.lowfreq: -2.6953 -0.0024 -0.0018 -0.0017 2.9758 10.3729 31.1962 36.3755 42.5248
frequency: 31.1693 36.3637 42.5224 46.6877 86.4439 91.7723 122.4879 135.9040 159.2292 201.8461 213.7957 244.0451 247.4147 300.2875 316.8907 376.4647 418.4114 452.0825 484.6002 507.2314 541.2904 564.0625 581.0937 631.2865 657.3063 684.4539 694.5126 703.0064 757.0644 779.3573 787.0794 793.5273 821.2417 839.7205 951.3634 977.4935 985.5142 988.6662 1000.4766 1017.7456 1036.3865 1036.9533 1043.9329 1119.7119 1139.0784 1152.8833 1186.1508 1216.5663 1220.4925 1259.2289 1259.8671 1280.3966 1294.3104 1319.7904 1325.1233 1354.8957 1357.5728 1377.8793 1392.9736 1442.5041 1461.2246 1461.7692 1486.9475 1505.9523 1518.4994 1562.0046 1626.1403 1640.8832 3019.1291 3023.9132 3064.2246 3064.5771 3074.7924 3080.2560 3147.8461 3148.9366 3149.4878 3154.8278 3169.0020 3178.4119 3535.1220
redmass: 13.7056 10.0738 9.3340 7.2124 4.3814 3.6831 3.6865 2.6635 5.5023 14.2065 4.3190 4.4620 4.5216 4.2343 4.8555 5.2711 3.0475 3.0150 5.3214 2.8919 4.6212 4.3411 1.2251 7.1590 5.9970 3.6898 4.2855 5.2951 4.7010 5.5952 1.1243 1.1564 1.2484 1.7749 2.9737 1.3553 1.3539 4.4973 1.4380 2.8023 3.7671 2.4813 2.0188 1.6108 1.3354 1.6196 1.5663 1.2234 1.9985 1.1610 1.1593 1.3249 1.1773 1.4225 2.6067 1.2485 1.4197 5.4208 1.8613 3.6273 1.0987 1.1033 1.0950 1.1833 2.4331 7.1202 6.3164 8.2761 1.0602 1.0609 1.0572 1.0579 1.1033 1.1038 1.0941 1.1082 1.1082 1.0880 1.0955 1.0964 1.0641
irintensity: 0.8629 0.6934 1.4497 1.3078 0.9723 1.2490 1.3597 1.5880 0.8746 0.8067 1.7290 14.2894 0.4083 1.0000 5.2545 25.1590 1.4501 13.7448 5.5342 28.8283 33.6674 25.4588 81.4116 3.7848 59.5277 79.4217 23.5453 66.7094 25.5432 0.3113 3.4974 10.1515 0.2678 59.0272 48.3297 2.0802 0.3806 107.3128 4.3723 227.6616 0.4545 5.6652 6.4312 37.0073 8.2262 259.4727 29.9995 10.5537 32.4146 15.4327 15.7236 44.2984 5.0558 36.2092 131.0153 0.4240 72.0639 7.3652 98.9886 7.7244 7.8705 13.2402 27.8883 6.3008 203.5227 12.5412 547.7547 262.1560 21.4017 16.1991 5.6631 23.8209 8.7175 7.1466 3.3074 12.6350 9.6606 10.7358 15.3469 6.3207 54.2049
temp: 298.150 k
press: 1.00000 atm
elementType: 17 17 8 8 7 6 6 6 6 6 6 6 6 6 6 6 1 1 1 1 1 1 1 1 1 1 1 1 1
symmnumber: 1
zpe: 587142.5 jmol-1
zpe.correction: 0.223631 hartree
zpe.thermalcorrener: 0.239870 hartree
zpe.thermalcorrenthalpy: 0.240814 hartree
zpe.thermalcorrgfe: 0.176778 hartree
zpe.sumelectzpe: -1551.103716 hartree
zpe.sumelectthermal: -1551.087477 hartree
zpe.sumelectthermalent: -1551.086533 hartree
zpe.sumelectthermalfe: -1551.150569 hartree
dipole: 1.8826 1.2689 -0.4308
dipole: 2.3108
quadrupole: -120.3220 -123.5726 -107.7490
quadrupole: -9.2063 3.2154 0.0038
quadrupole: -3.1075 -6.3580 9.4655 -9.2063 3.2154 0.0038
hfenergy: -1551.3273472 hartree
pointgroup: C01 [X(C11H13Cl2N1O2)]
dipole: 0.7452018 0.488403 -0.1807233 debye
polarizability: 248.4157461|0.872735|168.6789304|-2.4201187|-19.6010078|84.5508049 unknown
InChI: InChI=1S/C11H13Cl2NO2/c12-5-7-14(8-6-13)10-3-1-9(2-4-10)11(15)16/h1-4,15H,5-8H2
charge 0 multiplicity 1
29 atoms
Cl 3.670717 3.696256 0.00379
Cl 3.712923 -3.662002 -0.05668
O  -4.576097 1.142305 -0.322444
O  -4.677681 -1.048314 0.447349
N  1.773097 0.005929 -0.001078
C  2.533545 1.180439 -0.468656
C  2.555844 -1.161593 0.447224
C  0.366111 -0.000002 0.017532
C  -0.364654 -1.160018 0.434671
C  -0.386009 1.152727 -0.379618
C  2.708616 2.210522 0.663419
C  2.712874 -2.189738 -0.6892
C  -1.765812 -1.157839 0.454813
C  -1.788415 1.140766 -0.362489
C  -2.502842 -0.011746 0.056374
C  -3.977186 -0.065212 0.093664
H  3.529163 0.850948 -0.813764
H  2.039647 1.651497 -1.336366
H  3.556516 -0.822713 0.767754
H  2.088107 -1.637411 1.326704
H  0.157697 -2.069998 0.742282
H  0.1205 2.066808 -0.701363
H  1.749452 2.606958 1.025389
H  3.302021 1.814164 1.500673
H  1.74945 -2.599133 -1.024465
H  3.277461 -1.785775 -1.54262
H  -2.316665 -2.048311 0.77582
H  -2.346854 2.029485 -0.669974
H  -5.563025 1.032999 -0.271343
