program: Gaussian 09
title: 000116202
version: EM64L-G09RevD.01
frameworkgroup: C1[X(C2H5ClO4S)]
method: RPBEPBE
basis: SDD
operation: Freq
keyword: #p
keyword: freq=noraman
keyword: PBEPBE/SDD
title: #p freq=noraman PBEPBE/SDD
converged: NO YES NO NO
title: Mulliken charges:
elementType: Cl S O O O O C C H H H H H
charge: -0.057984 1.201970 -0.373551 -0.523304 -0.450456 -0.484307 -0.272566 -0.519521 0.255050 0.281258 0.273328 0.294803 0.375280
chargesum: 0.00000
title: Mulliken charges with hydrogens summed into heavy atoms:
elementType: Cl S O O O O C C
charge: -0.057984 1.201970 -0.373551 -0.148023 -0.450456 -0.484307 0.263741 0.048609
polarizability: 8.48579982e+01 -5.76911543e+00 7.34322725e+01 -3.06204284e+00 2.39121301e-02 5.56071248e+01
1716.lowfreq: -16.7231 -12.9289 -0.0014 0.0017 0.0024 2.5627 46.3430 90.0731 125.5279
frequency: 46.2497 89.9586 125.5195 162.6967 200.1979 254.0033 267.1672 302.9753 333.7996 398.1327 426.9771 444.0407 502.6257 573.4004 595.1022 822.6864 862.7342 912.6139 974.4978 997.2194 1057.1015 1165.0461 1166.9986 1218.1569 1292.0473 1349.0437 1427.5055 1428.4017 2981.9448 3043.9371 3067.5161 3156.6621 3270.6345
redmass: 10.3597 4.8919 12.0041 8.2304 6.5813 5.0714 3.9138 6.0306 12.4637 5.6662 2.5465 1.2908 5.3861 9.5500 6.3727 2.7639 16.1307 2.0935 2.0505 7.7188 2.3876 1.2290 1.2110 1.1277 1.1708 1.2454 1.0718 1.1017 1.0575 1.1026 1.0596 1.1107 1.0663
irintensity: 1.4834 1.9518 3.8008 1.0362 6.9805 3.1569 2.5041 5.3216 16.3160 6.4532 8.5892 83.4824 126.1936 33.7352 110.1036 26.4278 103.2852 26.8127 25.4883 73.7741 7.1380 89.8530 22.5262 1.6154 9.3321 9.8107 23.9707 13.1026 10.4449 0.7026 10.5313 2.8664 251.5758
temp: 298.150 k
press: 1.00000 atm
elementType: 17 16 8 8 8 8 6 6 1 1 1 1 1
symmnumber: 1
zpe: 208853.6 jmol-1
zpe.correction: 0.079548 hartree
zpe.thermalcorrener: 0.089391 hartree
zpe.thermalcorrenthalpy: 0.090336 hartree
zpe.thermalcorrgfe: 0.043647 hartree
zpe.sumelectzpe: -1237.363692 hartree
zpe.sumelectthermal: -1237.353848 hartree
zpe.sumelectthermalent: -1237.352904 hartree
zpe.sumelectthermalfe: -1237.399593 hartree
dipole: -5.2353 2.5384 0.1403
dipole: 5.8200
quadrupole: -65.9018 -57.7871 -66.6793
quadrupole: -5.4974 2.5430 1.0964
quadrupole: -2.4457 5.6690 -3.2232 -5.4974 2.5430 1.0964
hfenergy: -1237.4432398 hartree
pointgroup: C01 [X(C2H5Cl1O4S1)]
dipole: -2.2126817 0.5651489 0.1661273 debye
dipolederiv: -0.3258443 0.0481634 -0.0055362 -0.0298141 -0.4973488 -0.0600898 0.0078701 -0.0248876 -0.1531567 1.919227 0.0015266 0.0727666 -0.0900484 1.5402011 0.1143886 0.2521984 0.1060183 1.4646269 -1.0493338 0.155071 -0.056909 0.1215524 -0.4030742 -0.004426 0.0553287 0.0200449 -0.3973916 -0.6007887 -0.2163443 -0.1857476 -0.0769971 -0.8143323 -0.1723631 -0.1053761 -0.1507938 -0.5758783 -0.6179057 -0.033993 0.0069854 -0.0535279 -0.3950063 0.0028778 0.06204 0.0213028 -0.4284808 -0.5398109 -0.0122472 0.0494714 0.0384205 -0.4477561 0.0523372 -0.0906254 0.0366455 -0.6329971 0.6672592 -0.0112272 -0.0059668 0.1312726 -0.0056781 -0.002586 -0.2779319 0.0790891 0.1049794 0.0283186 -0.0640265 0.0016882 0.0125764 0.6730764 0.0151287 0.050705 -0.0035267 0.1568135 -0.0802149 0.027015 0.0202764 0.0256806 -0.0475718 -0.0339217 0.0302918 -0.0380972 0.1312482 0.0476877 0.0031692 -0.0592877 -0.0490473 0.1331869 0.0698297 0.0261136 0.0144644 0.0206502 -0.0533733 0.0272267 0.0630539 0.0106 0.0097172 -0.0152905 0.0691882 -0.0181033 0.0733717 0.1188189 0.0043886 0.0030657 0.0096214 -0.0373015 0.0379878 -0.0487151 0.0151916 -0.0253619 0.4859602 0.0712777 0.0961397 -0.0502891 0.2918875 -0.0038727 -0.0310873 -0.0573478 0.2615767 unknown
polarizability: 86.627815|-2.5429113|71.2337776|-3.4809092|2.7242165|56.0358029 unknown
InChI: InChI=1S/C2H5ClO4S/c3-1-2-7-8(4,5)6/h4H,1-2H2
charge 0 multiplicity 1
13 atoms
Cl -1.957817 -1.488866 -0.273735
S  1.489489 0.040923 0.050632
O  0.078474 1.154918 -0.524403
O  1.243694 -1.378681 -1.034291
O  2.838933 0.72375 -0.438837
O  1.207594 -0.346092 1.588699
C  -1.10509 1.146718 0.352627
C  -2.260223 0.390568 -0.289224
H  -1.386186 2.213245 0.461765
H  -0.852325 0.748713 1.355319
H  -3.197447 0.5252 0.272236
H  -2.387761 0.64909 -1.349777
H  0.278767 -1.666688 -0.923514
