program: Gaussian 09
title: 000116185
version: EM64L-G09RevD.01
frameworkgroup: C1[X(C18H16N2O4)]
method: RPBEPBE
basis: SDD
operation: Freq
keyword: #p
keyword: freq=noraman
keyword: PBEPBE/SDD
title: #p freq=noraman PBEPBE/SDD
converged: YES YES NO NO
title: Mulliken charges:
elementType: O O O O N N C C C C C C C C C C C C C C C C C C H H H H H H H H H H H H H H H H
charge: -0.287198 -0.315189 -0.247374 -0.320818 -0.344114 -0.335934 0.300604 0.252786 -0.331384 -0.347695 -0.348043 -0.349885 0.192230 0.474690 0.176662 -0.236281 -0.366654 -0.383740 -0.367800 -0.233932 -0.232465 0.268758 -0.232933 -0.499380 0.217479 0.281766 0.275885 0.275133 0.357420 0.263464 0.225637 0.237461 0.346627 0.214407 0.230589 0.232410 0.234127 0.244669 0.244372 0.233638
chargesum: 0.00000
title: Mulliken charges with hydrogens summed into heavy atoms:
elementType: O O O O N N C C C C C C C C C C C C C C C C C C
charge: -0.287198 -0.315189 -0.247374 -0.320818 0.013306 0.010693 0.300604 0.252786 -0.113905 -0.065929 -0.072158 -0.074752 0.192230 0.474690 0.176662 0.027183 -0.141017 -0.146279 -0.153393 -0.003343 -0.000055 0.268758 0.001195 0.223300
polarizability: 5.59158631e+02 -1.64170816e+01 2.25701514e+02 -1.10435338e+00 1.93988191e-01 9.11492621e+01
1716.lowfreq: -4.5921 -0.0012 0.0006 0.0013 1.8768 7.3730 11.4504 17.3860 23.0405
frequency: 11.0724 17.3130 22.9255 30.8429 54.3826 68.9394 70.0271 86.0131 99.1267 112.2688 127.0883 138.0563 158.9272 164.5870 200.3805 238.2107 250.5354 279.4297 293.2764 297.7660 318.5637 326.9069 402.7786 403.5544 430.1371 440.3585 472.1641 491.4836 509.2253 526.2938 577.1701 578.9695 615.2244 620.8069 629.9041 661.5790 680.6621 683.8117 693.0499 702.1437 720.7361 772.6473 773.3394 774.2654 827.5106 846.4920 847.0837 872.8517 877.6589 893.4500 920.6650 926.4485 980.0290 983.1609 988.3586 995.5795 996.2841 1008.5954 1010.9320 1016.6834 1025.5812 1054.6862 1074.4169 1084.6715 1115.0101 1120.1062 1144.2986 1149.4747 1174.8884 1192.4232 1192.9880 1216.4555 1221.6582 1252.3896 1261.1960 1297.6719 1310.2003 1321.1225 1336.8635 1378.8843 1386.5323 1406.7026 1416.0530 1424.9713 1440.9509 1452.4852 1463.4119 1486.0473 1496.6404 1522.3508 1529.1826 1564.0525 1582.3801 1588.7012 1610.5704 1620.7629 1625.9405 1645.9762 3005.5474 3103.2904 3107.4842 3120.2986 3125.5809 3129.7389 3133.4341 3141.5824 3150.4828 3152.6907 3155.4451 3168.3567 3173.3995 3180.7400 3484.7150 3502.5956
redmass: 5.0245 6.1800 6.3238 4.7985 4.6222 5.8372 4.0781 5.2184 1.3057 4.7384 5.3417 4.0107 6.8015 3.8347 5.4251 8.0667 4.2437 3.3073 8.7002 4.9502 6.1594 6.0806 2.7594 2.8246 5.7675 6.2442 4.0260 2.8732 6.1744 5.1871 3.7872 1.5129 6.3750 1.2330 5.8451 5.2449 6.8075 3.0002 2.5233 1.9609 6.4976 5.9460 2.5157 3.0595 5.5310 1.4091 1.3261 1.7830 4.7087 1.5058 8.0927 1.4275 1.3825 1.3903 6.1293 4.4396 1.2927 1.2547 3.2450 1.3719 2.2385 4.2658 3.4643 1.6090 1.2638 1.3986 2.0170 1.4910 1.0674 1.1374 1.1549 1.8784 2.1043 4.1464 1.8310 1.9321 1.3126 1.6976 1.2746 5.0956 6.8150 4.0192 3.1310 1.2370 2.3009 1.0494 1.0516 2.3126 2.5745 3.8353 4.3153 6.3723 5.7139 7.0133 5.8980 6.4707 9.2807 5.5175 1.0296 1.0910 1.1045 1.0898 1.0861 1.0869 1.0899 1.0916 1.1048 1.0964 1.0886 1.1016 1.0965 1.0953 1.0790 1.0795
irintensity: 0.4430 0.6751 1.0694 0.0187 0.4764 0.3278 0.1883 2.0880 0.0172 6.5124 3.5665 5.2612 4.1859 6.4640 7.5508 13.5398 1.8333 1.4978 9.7337 9.2123 33.3381 7.4694 0.0429 0.2258 3.0443 1.0756 0.9379 21.6830 4.6858 30.0724 13.3961 28.9528 0.4679 145.0726 7.3681 0.2025 0.5502 55.3592 12.4107 71.3307 2.7956 8.4010 43.4630 31.9582 1.3688 11.8381 8.8467 18.2724 11.2359 33.6954 4.2122 0.0065 0.7867 0.3810 1.1076 5.5877 15.0744 33.8388 38.2677 0.3805 1.5494 62.1297 151.6969 12.1607 0.0343 30.3686 50.1334 68.4206 1.2092 23.0199 9.7367 0.6110 54.7035 470.8034 8.5783 0.8594 2.3845 24.2678 6.2127 99.1737 1.6767 522.6179 552.3762 9.2187 43.7946 14.6694 11.5795 40.5712 56.6426 146.3190 174.5211 32.6118 5.1964 103.6660 0.2647 6.9257 243.0480 150.7887 44.7494 0.6771 25.4178 14.9885 6.0884 1.8122 15.2836 5.2092 14.7412 37.3876 0.3159 35.6707 1.4428 0.8206 15.0526 190.0588
temp: 298.150 k
press: 1.00000 atm
elementType: 8 8 8 8 7 7 6 6 6 6 6 6 6 6 6 6 6 6 6 6 6 6 6 6 1 1 1 1 1 1 1 1 1 1 1 1 1 1 1 1
symmnumber: 1
zpe: 798763.4 jmol-1
zpe.correction: 0.304233 hartree
zpe.thermalcorrener: 0.326552 hartree
zpe.thermalcorrenthalpy: 0.327496 hartree
zpe.thermalcorrgfe: 0.248021 hartree
zpe.sumelectzpe: -1104.216693 hartree
zpe.sumelectthermal: -1104.194374 hartree
zpe.sumelectthermalent: -1104.193430 hartree
zpe.sumelectthermalfe: -1104.272905 hartree
dipole: 2.5479 -1.8021 -0.1818
dipole: 3.1261
quadrupole: -99.7639 -136.0648 -145.3403
quadrupole: 23.3008 1.0507 0.2986
quadrupole: 27.2924 -9.0084 -18.2840 23.3008 1.0507 0.2986
hfenergy: -1104.5209258 hartree
pointgroup: C01 [X(C18H16N2O4)]
dipole: -1.0133986 0.6818833 -0.1438251 debye
polarizability: 559.5729011|-10.5077192|223.9835109|5.1480352|-12.9896335|92.4529944 unknown
InChI: InChI=1S/C18H16N2O4/c1-24-18(23)15-10-8-14(9-11-15)17(22)20-19-16(21)12-7-13-5-3-2-4-6-13/h2-12,19-20H,1H3
charge 0 multiplicity 1
40 atoms
O  7.087786 1.673928 -0.13509
O  0.89485 -2.430852 0.1952
O  7.781047 -0.506266 0.308551
O  -1.712046 1.565429 -0.038155
N  0.248363 -0.233052 0.05018
N  -1.08148 -0.646642 0.059791
C  2.655495 -0.732577 0.101614
C  5.398253 -0.011228 0.100493
C  3.043139 0.614447 -0.134448
C  3.655324 -1.714026 0.328963
C  4.403862 0.973359 -0.134576
C  5.014865 -1.357837 0.330388
C  1.233714 -1.198968 0.11771
C  -5.936403 0.371845 -0.007719
C  6.854081 0.316939 0.109181
C  -4.505463 0.700213 -0.014158
C  -6.432725 -0.964533 0.039867
C  -6.878711 1.440019 -0.051174
C  -3.450373 -0.170507 0.026678
C  -7.81746 -1.217521 0.044085
C  -8.266078 1.186858 -0.046902
C  -2.065532 0.334855 0.012667
C  -8.741625 -0.143863 0.000878
C  8.512526 2.080643 -0.145812
H  2.300442 1.39456 -0.336733
H  3.334002 -2.746183 0.498879
H  4.708632 2.006731 -0.318614
H  5.796896 -2.103297 0.506078
H  0.340163 0.788648 0.021367
H  -4.243515 1.767743 -0.056344
H  -5.734163 -1.808021 0.073239
H  -6.511271 2.472869 -0.088239
H  -1.194578 -1.664928 0.11267
H  -3.594901 -1.257401 0.070647
H  -8.182715 -2.249782 0.080888
H  -8.973963 2.022053 -0.080631
H  -9.818494 -0.344944 0.004356
H  8.97989 1.85909 0.828285
H  9.056919 1.540416 -0.938483
H  8.494348 3.16168 -0.341879
