program: Gaussian 09
title: 000116167
version: EM64L-G09RevD.01
frameworkgroup: C1[X(C13H16FN)]
method: RPBEPBE
basis: SDD
operation: Freq
keyword: #p
keyword: freq=noraman
keyword: PBEPBE/SDD
title: #p freq=noraman PBEPBE/SDD
converged: NO YES NO NO
title: Mulliken charges:
elementType: F N C C C C C C C C C C C C C H H H H H H H H H H H H H H H H
charge: -0.209880 -0.331584 -0.022952 -0.483115 -0.467241 -0.542076 0.322142 -0.378723 0.325750 -0.646263 -0.345612 -0.356540 -0.387098 -0.392424 0.320909 0.193737 0.230579 0.189207 0.230374 0.210239 0.217153 0.233358 0.207969 0.252463 0.219524 0.234777 0.190719 0.235234 0.245279 0.252414 0.251681
chargesum: 0.00000
title: Mulliken charges with hydrogens summed into heavy atoms:
elementType: F N C C C C C C C C C C C C C
charge: -0.209880 -0.079121 0.170784 -0.063329 -0.016730 -0.101463 0.322142 -0.170754 0.325750 -0.001242 -0.110378 -0.111261 -0.134684 -0.140743 0.320909
polarizability: 2.25341872e+02 9.64165635e+00 1.37949020e+02 -1.30223144e+00 -6.67660040e+00 8.63131590e+01
1716.lowfreq: -5.7039 -0.0009 -0.0006 -0.0004 0.8290 8.8403 39.2307 47.9953 75.9637
frequency: 39.1623 47.9909 75.9585 107.1722 125.6876 178.2755 192.6396 223.8468 237.2955 247.3947 319.0135 352.5844 394.3602 412.1947 431.3316 442.2572 463.7438 470.4161 522.3524 545.1707 600.3645 629.5005 666.9851 714.7481 736.9851 794.7933 808.8131 811.7110 818.8323 849.0561 917.3767 930.4845 940.3033 944.9093 953.9314 978.7657 1001.1995 1006.0411 1066.9756 1083.8302 1101.2976 1106.4984 1112.3337 1130.1215 1156.1787 1159.8630 1176.3026 1207.1536 1226.5869 1235.4080 1257.2983 1296.0266 1297.8162 1305.1959 1319.4529 1342.1328 1348.1848 1369.3457 1379.7782 1410.1811 1436.8610 1451.9616 1458.0270 1462.1290 1468.3892 1471.4515 1495.6972 1498.0739 1591.4856 1610.0307 1657.1007 2825.8493 2872.5945 2951.5529 2955.4074 2976.1241 3009.4878 3015.1391 3024.1333 3041.5548 3079.0600 3105.8134 3148.2609 3150.8838 3173.7735 3177.3428 3436.5608
redmass: 4.5787 3.1493 4.0392 2.5763 4.1963 1.8094 1.8767 2.7976 2.3248 4.2831 3.5245 5.1358 3.3050 2.9583 3.2324 2.4445 3.4419 3.0164 3.4849 2.7506 4.2057 7.1351 1.5498 3.3089 3.1504 5.5989 1.3218 1.3936 1.5023 1.7551 1.6665 2.7878 1.7066 1.8800 1.3584 2.8439 2.4177 2.2512 2.0767 1.7157 1.7552 1.3609 1.3674 1.2081 1.6062 3.5332 1.6046 1.8898 1.4732 1.4197 2.3838 1.3942 1.3144 1.3018 1.2811 1.5834 2.2286 2.0873 2.5247 3.5562 1.1698 1.1314 1.1665 1.0907 1.0944 1.0954 1.0503 2.5384 7.2726 6.3338 6.6151 1.0807 1.0564 1.0644 1.0616 1.0623 1.0967 1.0942 1.0744 1.1009 1.0999 1.0898 1.0880 1.0880 1.0960 1.0969 1.0744
irintensity: 0.2006 0.5187 0.2441 1.0591 0.9501 0.5448 1.9750 2.0888 1.8746 0.2377 0.8193 4.6163 6.2925 0.0195 3.0510 2.1650 34.7428 7.5260 7.9263 4.4180 12.6388 0.1606 89.8582 3.2475 5.9684 17.8525 37.9696 5.7163 59.4890 15.2534 4.2213 0.4151 0.8222 0.6218 0.3743 2.9941 20.0779 1.9241 1.3710 1.5497 24.6190 2.0168 5.6542 10.6360 59.6069 24.4853 4.6630 38.2009 0.1073 4.7353 6.4180 4.7909 2.0510 4.2900 2.9228 7.4603 0.4365 9.1728 17.1497 3.0680 7.3511 8.7692 0.9086 19.5897 7.6581 3.1440 23.4373 119.3336 3.8553 8.3901 15.1811 77.3016 144.6956 24.7584 32.4439 52.3909 30.8652 22.6724 48.5140 49.2638 41.1221 29.8537 7.0420 10.8882 8.9208 2.6669 2.3919
temp: 298.150 k
press: 1.00000 atm
elementType: 9 7 6 6 6 6 6 6 6 6 6 6 6 6 6 1 1 1 1 1 1 1 1 1 1 1 1 1 1 1 1
symmnumber: 1
zpe: 679277.7 jmol-1
zpe.correction: 0.258723 hartree
zpe.thermalcorrener: 0.272708 hartree
zpe.thermalcorrenthalpy: 0.273652 hartree
zpe.thermalcorrgfe: 0.217495 hartree
zpe.sumelectzpe: -658.440405 hartree
zpe.sumelectthermal: -658.426420 hartree
zpe.sumelectthermalent: -658.425476 hartree
zpe.sumelectthermalfe: -658.481634 hartree
dipole: -3.1327 0.7168 -0.6957
dipole: 3.2881
quadrupole: -99.4866 -79.5466 -93.1913
quadrupole: -2.3900 4.8739 -1.7230
quadrupole: -8.7451 11.1949 -2.4498 -2.3900 4.8739 -1.7230
hfenergy: -658.6991284 hartree
pointgroup: C01 [X(C13H16F1N1)]
dipole: -1.2314576 0.2676121 -0.2922544 debye
polarizability: 225.2038136|10.3700321|137.8465683|0.1099542|-7.4916781|86.5536693 unknown
InChI: InChI=1S/C13H16FN/c1-15-13-8-4-11(5-9-13)10-2-6-12(14)7-3-10/h2-4,6-7,13,15H,5,8-9H2,1H3
charge 0 multiplicity 1
31 atoms
F  5.420308 -0.055178 -0.12496
N  -4.648131 0.201435 0.16857
C  -3.217449 0.222685 -0.213865
C  -2.46532 1.258082 0.647161
C  -2.571777 -1.167658 -0.008598
C  -0.9892 1.379076 0.214623
C  -0.306164 0.017557 0.077714
C  -1.057586 -1.120752 -0.027433
C  1.185093 -0.010807 0.035524
C  -5.528991 -0.615387 -0.690313
C  1.92716 -1.174427 0.394956
C  1.921477 1.14403 -0.357396
C  3.334695 -1.201445 0.34045
C  3.331709 1.140525 -0.419225
C  4.00858 -0.038616 -0.072147
H  -3.08151 0.506268 -1.291608
H  -2.530058 0.942497 1.70631
H  -2.958931 2.248381 0.569331
H  -0.438392 2.000075 0.94758
H  -0.931405 1.921743 -0.753092
H  -2.921258 -1.879115 -0.782787
H  -2.933192 -1.568531 0.962849
H  -0.552907 -2.087753 -0.15945
H  -5.008696 1.1599 0.272627
H  -6.578936 -0.469465 -0.381057
H  -5.297451 -1.6880 -0.564525
H  -5.449929 -0.379137 -1.780343
H  1.398446 -2.065187 0.748987
H  1.389925 2.059078 -0.635868
H  3.903051 -2.092321 0.62304
H  3.894738 2.025642 -0.728958
