program: Gaussian 09
title: 000116165
version: EM64L-G09RevD.01
frameworkgroup: C1[X(C14H20O2)]
method: RPBEPBE
basis: SDD
operation: Freq
keyword: #pfreq=noraman
keyword: PBEPBE/SDD
title: #p freq=noraman PBEPBE/SDD
converged: YES YES NO NO
title: Mulliken charges:
elementType: O O C C C C C C C C C C C C C C H H H H H H H H H H H H H H H H H H H H
charge: -0.273083 -0.245223 -0.103207 -0.217225 -0.429275 -0.423825 -0.415017 -0.303213 -0.460926 -0.435140 -0.192290 -0.455166 0.248175 -0.207001 -0.187207 -0.195985 0.204446 0.238740 0.197478 0.222524 0.201321 0.207301 0.224457 0.204715 0.221285 0.234354 0.214039 0.247397 0.211415 0.212187 0.200753 0.241199 0.206864 0.202467 0.200675 0.201990
chargesum: 0.00000
title: Mulliken charges with hydrogens summed into heavy atoms:
elementType: O O C C C C C C C C C C C C C C
charge: -0.273083 -0.245223 0.101238 0.021515 -0.009273 -0.015202 0.014155 0.152426 0.000510 -0.011538 0.008462 -0.007102 0.248175 -0.004534 0.013469 0.006004
polarizability: 1.69158283e+02 1.51031262e+01 1.47159136e+02 7.21240806e+00 1.67697831e-02 1.22270877e+02
1716.lowfreq: -38.0423 -6.2792 -3.3377 0.0008 0.0009 0.0009 13.1783 28.2798 43.1507
frequency: -33.6674 27.3928 43.0706 50.3898 85.9378 98.8977 152.0155 178.4348 203.3383 258.8383 285.9950 302.6934 309.9805 349.5243 385.7209 413.9412 454.1271 466.4806 502.8700 531.1263 545.3948 601.5680 652.9734 674.0832 707.1630 721.0497 780.9969 783.8362 811.2922 844.8112 857.2837 869.9520 884.3519 896.3465 909.3756 921.8914 951.9630 960.2400 970.2985 973.4406 977.7421 981.2227 1042.1631 1050.5230 1067.6394 1081.6962 1089.9607 1102.7018 1107.3339 1125.4315 1137.1815 1140.7635 1180.3270 1183.8928 1200.8827 1219.1416 1225.1326 1239.0125 1256.1993 1274.3937 1278.4362 1310.2827 1313.7356 1331.5469 1336.2217 1340.4366 1344.2141 1345.9541 1352.3873 1357.8955 1382.3546 1390.1611 1450.6849 1454.7876 1461.9737 1467.5452 1470.4384 1471.7032 1477.8288 1623.1727 1674.6227 1676.4444 2921.4361 2954.6253 2960.8891 2963.9545 2975.9867 2976.8030 2985.9125 2994.3183 2999.4161 3008.2694 3015.1583 3033.0481 3037.6972 3052.4558 3063.0014 3073.3429 3081.0842 3092.4897 3116.3462 3125.2809
redmass: 3.7489 6.1862 3.6227 3.5033 3.9792 3.1197 2.6848 4.4671 3.4819 1.8636 3.0806 2.4289 2.4659 2.5193 2.0701 3.1226 2.2570 4.6507 5.6680 4.2423 3.7801 2.3122 1.4611 2.5858 2.3912 1.5457 2.7588 1.9199 3.8706 2.6006 2.6912 2.4704 2.1330 2.3067 2.2346 2.5908 2.5531 2.6404 1.3542 1.2674 2.1204 1.5802 2.1709 1.8381 1.6871 2.1940 1.6546 1.6332 1.6247 2.0213 1.1878 1.3139 1.2001 1.2309 1.1360 1.2417 1.1900 1.3186 1.2207 1.4872 1.5307 1.7298 1.3966 1.3881 1.5714 1.5608 1.4778 1.5069 1.5682 1.4503 1.5807 1.5473 1.0937 1.0877 1.0759 1.0919 1.0828 1.0886 1.0871 10.9753 6.9666 6.3435 1.0803 1.0633 1.0736 1.0630 1.0703 1.0635 1.0626 1.0745 1.0581 1.0928 1.0892 1.0950 1.1005 1.1021 1.1074 1.0989 1.0841 1.0839 1.0985 1.0992
irintensity: 0.0223 1.2955 0.3129 0.0102 0.1951 1.1473 0.8698 2.0416 2.8319 0.3641 4.0996 7.3363 2.1511 0.3088 0.2661 1.0273 4.1654 6.3467 3.6179 3.9246 1.5630 5.4825 50.2689 31.1066 8.5953 18.5991 4.3522 6.5846 5.4393 6.0339 4.1640 13.4095 5.9484 14.8184 5.4485 12.2407 6.1499 13.9244 2.8750 0.9605 4.2964 2.0040 69.9789 5.9893 21.2363 5.5387 29.4391 1.7265 1.4084 205.3126 15.0030 77.8342 16.8543 31.9720 11.2076 1.9326 0.7132 2.4723 0.3527 2.1741 1.7155 16.5494 6.3916 2.2184 0.7944 0.7119 2.5130 2.3630 3.3288 1.0373 0.4700 1.5319 14.7632 11.3675 23.6920 1.3014 6.7530 16.8373 9.4170 177.3718 3.6443 5.7087 26.3146 36.7034 16.5493 33.6046 33.3170 26.6625 37.6545 25.8316 37.1689 53.8762 56.5534 8.9524 45.2801 57.9435 22.8848 33.1839 10.6867 9.2464 46.2301 60.3189
temp: 298.150 k
press: 1.00000 atm
elementType: 8 8 6 6 6 6 6 6 6 6 6 6 6 6 6 6 1 1 1 1 1 1 1 1 1 1 1 1 1 1 1 1 1 1 1 1
symmnumber: 1
zpe: 812544.1 jmol-1
zpe.correction: 0.309482 hartree
zpe.thermalcorrener: 0.324084 hartree
zpe.thermalcorrenthalpy: 0.325028 hartree
zpe.thermalcorrgfe: 0.266679 hartree
zpe.sumelectzpe: -694.676408 hartree
zpe.sumelectthermal: -694.661806 hartree
zpe.sumelectthermalent: -694.660862 hartree
zpe.sumelectthermalfe: -694.719212 hartree
dipole: 1.9087 1.1312 1.2634
dipole: 2.5532
quadrupole: -93.3618 -97.8648 -94.5624
quadrupole: -4.3306 -2.7283 -2.8003
quadrupole: 1.9012 -2.6018 0.7006 -4.3306 -2.7283 -2.8003
hfenergy: -694.9858902 hartree
pointgroup: C01 [X(C14H20O2)]
dipole: -0.7308987 -0.5329335 0.4368279 debye
polarizability: 167.1303048|16.9789013|149.5040651|-4.4907815|1.8822445|121.9539266 unknown
InChI: InChI=1S/C14H20O2/c15-14(13-9-5-2-6-10-13)16-11-12-7-3-1-4-8-12/h2-3,5,7,12-13H,1,4,6,8-11H2
charge 0 multiplicity 1
36 atoms
O  -0.065948 0.947104 0.266151
O  1.598372 2.427007 -0.392715
C  -2.347711 0.901929 -0.627375
C  2.151363 0.584353 1.18312
C  -2.990752 0.693219 0.767739
C  -4.18003 -0.291661 0.687738
C  1.745081 -0.911751 1.268215
C  -1.044808 1.713586 -0.559437
C  3.637161 0.730882 0.764263
C  -3.714224 -1.684335 0.197996
C  -2.151547 -0.424662 -1.349978
C  1.928859 -1.631622 -0.087743
C  1.250146 1.414554 0.259078
C  -2.758409 -1.581672 -0.978204
C  4.020412 -0.227291 -0.350688
C  3.250373 -1.2760 -0.744993
H  -3.037973 1.529064 -1.238733
H  2.020666 1.038757 2.18867
H  -3.321605 1.667485 1.178296
H  -2.222674 0.291089 1.455717
H  -4.938028 0.107536 -0.016009
H  -4.672049 -0.380662 1.67492
H  0.70053 -1.007991 1.609815
H  2.396459 -1.388819 2.02646
H  -1.20163 2.698739 -0.08089
H  -0.603243 1.878671 -1.559587
H  4.286377 0.556447 1.647133
H  3.822429 1.771939 0.438925
H  -4.589845 -2.302528 -0.084763
H  -3.214928 -2.23077 1.026647
H  -1.479455 -0.418304 -2.22115
H  1.086542 -1.375826 -0.763997
H  1.869278 -2.728037 0.062653
H  -2.555563 -2.502274 -1.543759
H  4.974916 -0.033154 -0.859171
H  3.583259 -1.906201 -1.581749
