program: Gaussian 09
title: 000014352
version: EM64L-G09RevD.01
frameworkgroup: C1[X(C12H10N2O2)]
method: RPBEPBE
basis: SDD
operation: Freq
keyword: #p
keyword: freq=noraman
keyword: PBEPBE/SDD
title: #p freq=noraman PBEPBE/SDD
converged: NO YES NO NO
title: Mulliken charges:
elementType: O O N N C C C C C C C C C C C C H H H H H H H H H H
charge: -0.219963 -0.180843 0.018757 -0.697434 0.201214 0.318821 0.182160 -0.344709 -0.344833 -0.330111 -0.367234 0.486757 -0.403554 -0.403655 -0.230452 -0.213447 0.231771 0.231817 0.259240 0.287818 0.215410 0.215398 0.237568 0.240585 0.304457 0.304462
chargesum: 0.00000
title: Mulliken charges with hydrogens summed into heavy atoms:
elementType: O O N N C C C C C C C C C C C C
charge: -0.219963 -0.180843 0.018757 -0.088515 0.201214 0.318821 0.182160 -0.112938 -0.113015 -0.070871 -0.079416 0.486757 -0.188144 -0.188257 0.007116 0.027138
polarizability: 2.28756200e+02 -1.21974777e+01 1.33471266e+02 7.30528049e-02 1.01421504e-01 1.01390850e+02
1716.lowfreq: -52.0156 -42.1452 -5.9528 -0.0007 0.0004 0.0005 8.0725 9.1939 54.9447
frequency: -52.0031 -42.1326 54.9352 70.7170 139.2747 163.3779 233.4765 272.6333 285.1945 347.8531 367.9354 370.7129 378.6109 398.7127 416.3046 425.3926 498.9229 541.4054 555.6734 568.2482 633.5736 644.7818 670.4970 709.5125 727.3863 748.5889 784.2841 788.7247 812.2320 820.8905 821.8435 890.3131 934.3120 949.3024 976.9882 985.0753 1002.0430 1016.0141 1017.6640 1036.3681 1071.8179 1129.3990 1135.3780 1171.9366 1190.0588 1202.3641 1249.7045 1284.6713 1305.6328 1316.0522 1362.7470 1367.9870 1373.7937 1427.1254 1430.1648 1465.8212 1521.9974 1572.4267 1573.5769 1608.3777 1633.0853 1645.7882 3116.4797 3118.2181 3137.5445 3140.9190 3146.6616 3153.2581 3166.9621 3186.4773 3568.0722 3707.8591
redmass: 3.9038 14.1839 6.0673 4.3698 5.1684 5.7615 5.5263 8.6903 4.3668 1.2344 1.0630 7.6915 2.7037 2.6998 7.4383 3.7426 4.4064 3.5264 2.9514 6.8152 6.3165 6.9682 5.0257 6.2336 3.7499 3.8834 1.4401 8.1598 1.2593 2.8026 2.6834 1.3788 1.3616 1.3533 1.3715 5.6717 1.3354 2.9141 1.4370 3.3731 2.1807 1.2341 1.7875 1.0836 1.1429 7.8491 1.6873 2.0290 1.3509 3.4902 11.5365 4.3612 4.7469 2.5776 3.6892 2.6063 3.3311 6.4599 6.7945 6.9567 2.3554 1.6942 1.0874 1.0871 1.0864 1.0962 1.0972 1.0915 1.0972 1.0963 1.0449 1.1039
irintensity: 0.0009 0.0733 3.4739 2.6004 0.0019 1.8264 1.5301 5.0759 0.4528 304.6526 0.1473 9.4448 1.4487 0.0457 0.9644 0.3217 6.2511 8.4047 15.9238 3.3188 0.3880 6.2174 20.8547 5.7650 1.3156 9.1130 57.0077 7.2010 0.0871 37.4888 55.2105 0.3240 0.1426 0.0885 2.2970 4.9659 0.3148 0.8829 0.3171 0.2563 25.6615 16.6747 3.9221 8.9183 38.3776 213.7737 0.8702 0.9404 2.7974 100.9846 103.5088 8.5025 35.6468 6.4118 0.4862 115.9568 74.3682 14.6573 3.4292 15.1931 7.2093 310.7676 3.7017 34.8345 2.0922 35.4335 1.0353 13.2800 14.6824 9.1832 77.9256 20.4610
temp: 298.150 k
press: 1.00000 atm
elementType: 8 8 7 7 6 6 6 6 6 6 6 6 6 6 6 6 1 1 1 1 1 1 1 1 1 1
symmnumber: 1
zpe: 511655.6 jmol-1
zpe.correction: 0.194879 hartree
zpe.thermalcorrener: 0.206761 hartree
zpe.thermalcorrenthalpy: 0.207706 hartree
zpe.thermalcorrgfe: 0.156691 hartree
zpe.sumelectzpe: -722.028772 hartree
zpe.sumelectthermal: -722.016890 hartree
zpe.sumelectthermalent: -722.015946 hartree
zpe.sumelectthermalfe: -722.066960 hartree
dipole: -1.9561 -4.4844 0.0066
dipole: 4.8924
quadrupole: -62.3104 -102.1530 -86.4850
quadrupole: -10.7714 0.0031 0.0550
quadrupole: 21.3391 -18.5036 -2.8355 -10.7714 0.0031 0.0550
hfenergy: -722.2236518 hartree
pointgroup: C01 [X(C12H10N2O2)]
dipole: 0.6833415 1.7994412 0.0008634 debye
dipolederiv: -0.6848032 -0.1846363 0.0011792 -0.311216 -0.8143248 0.0007475 0.0004614 0.0003325 -0.2443904 -0.821438 0.0803382 0.0017626 0.0383617 -0.5767772 -0.000531 0.0015508 -0.0002652 -0.162379 1.301519 -0.0579523 -0.0035122 0.0855634 1.5767807 -0.000203 -0.0024154 -0.0001484 0.1748236 -1.7325919 0.0167749 -0.0004834 -0.0032986 -0.73701 -0.002132 -0.0006257 -0.0020681 -0.086612 0.550984 0.1356195 0.0003673 -0.1999648 0.1852528 0.00029 0.000125 -0.0003625 -0.0460336 -0.06684 0.0139223 0.0000164 0.1477786 -0.019346 0.0006061 0.0011074 0.0008887 -0.2343644 -0.0763741 0.1738536 0.0003609 0.1434202 -0.5090755 -0.0000936 0.0019486 0.0001901 0.057746 0.1400199 -0.0235257 0.142916 -0.0314293 -0.1040037 -0.0413435 0.1228764 -0.0060445 0.1755895 0.141441 -0.0224735 -0.1430965 -0.0257065 -0.1039691 0.0396477 -0.1233662 0.0043559 0.1757863 -0.3549408 0.177718 0.0000963 0.2693353 -0.0224488 0.0000213 -0.0022334 -0.0003625 -0.1210565 -0.1244161 -0.2116342 -0.000011 0.0535255 0.0767915 -0.0001362 0.0000508 0.0004605 -0.1002041 1.8201836 -0.0707859 0.0003839 -0.0991657 0.1411976 0.000572 0.0002859 0.0003871 -0.0405575 -0.4243488 0.004545 -0.0725302 -0.0083693 -0.2232791 -0.0006943 0.391926 -0.0181782 0.0586847 -0.4244064 0.0041543 0.0722854 -0.0059597 -0.2234358 -0.0010659 -0.3924541 0.0164579 0.0584835 0.1131796 -0.0177611 -0.0000828 0.011262 0.1858733 -0.0000651 -0.0004424 0.0000479 -0.1159721 0.127047 -0.0623643 -0.0001713 -0.1347949 -0.2564737 0.0000165 -0.0003804 0.0000698 -0.1549319 0.052645 0.0089857 0.0998022 0.0090573 0.1273506 0.0001717 0.0983581 -0.0027036 -0.0468191 0.0528518 0.00966 -0.0997026 0.0096604 0.1273683 0.0010148 -0.098257 0.0037478 -0.0469301 0.0415233 -0.09495 0.0000614 -0.0985315 0.0044023 -0.0000511 0.0000168 0.000078 0.1294918 0.074789 -0.0313336 -0.0000265 -0.0702587 0.0828963 0.0000181 0.0003827 -0.0000527 0.1650467 -0.0407071 0.0080283 -0.1090888 0.0189402 0.1648014 0.0076196 -0.1041791 0.0044386 -0.0661951 -0.0409104 0.0073496 0.109208 0.0176151 0.1648129 -0.0061576 0.1043489 -0.0029834 -0.0661356 0.0478646 0.0614619 0.0000047 0.086259 -0.081749 0.0000069 0.0004125 0.0000421 0.15195 -0.1090401 0.0447936 0.0000952 0.0295026 0.0750372 -0.0000111 0.0001868 -0.0000571 0.1586433 0.2183836 0.0151421 -0.011871 0.0342097 0.3796907 -0.0064328 -0.0349782 -0.002419 0.1131162 0.2183851 0.0150698 0.0120369 0.0342041 0.3796372 0.0081849 0.035294 0.0041484 0.1132198 unknown
polarizability: 229.711876|-7.5368724|132.5153609|-0.0627142|-0.1343577|101.3910799 unknown
InChI: InChI=1S/C12H10N2O2/c13-10-7-5-9(6-8-10)11-3-1-2-4-12(11)14(15)16/h1-8H,13H2
charge 0 multiplicity 1
26 atoms
O  -2.36696 -2.849855 0.002572
O  -0.170673 -2.269273 -0.004261
N  -1.420854 -1.964291 -0.000335
N  4.883056 0.145598 0.000888
C  -0.866483 0.529704 -0.000193
C  0.626828 0.376187 -0.00006
C  -1.826158 -0.52539 0.00023
C  1.35381 0.343197 1.216176
C  1.354765 0.351073 -1.215901
C  -1.389989 1.852282 -0.000254
C  -3.221285 -0.279471 0.000844
C  3.489084 0.226318 0.000583
C  2.759245 0.2676 1.223788
C  2.760213 0.275407 -1.222899
C  -2.776171 2.115338 0.000162
C  -3.698447 1.043156 0.000799
H  0.814111 0.36568 2.169981
H  0.815794 0.379643 -2.169955
H  -0.674501 2.681062 -0.000473
H  -3.90066 -1.135397 0.001239
H  3.297797 0.236306 2.179033
H  3.299511 0.250144 -2.177903
H  -3.133649 3.150754 0.000123
H  -4.776274 1.234464 0.00121
H  5.4013 0.087435 -0.870428
H  5.400589 0.081828 0.872234
