program: Gaussian 09
title: 000116139
version: EM64L-G09RevD.01
frameworkgroup: C1[X(C15H15NO3)]
method: RPBEPBE
basis: SDD
operation: Freq
keyword: #p
keyword: freq=noraman
keyword: PBEPBE/SDD
title: #p freq=noraman PBEPBE/SDD
converged: YES YES NO NO
title: Mulliken charges:
elementType: O O O N C C C C C C C C C C C C C C C H H H H H H H H H H H H H H H
charge: -0.492861 -0.292222 -0.449643 -0.416781 0.240015 0.123470 0.055011 0.241806 -0.380842 -0.341428 0.131631 -0.248114 -0.370681 -0.452720 -0.392272 -0.313546 -0.218332 -0.220101 -0.236026 0.251268 0.286983 0.234346 0.221518 0.234485 0.375960 0.287990 0.254237 0.218439 0.232512 0.235419 0.233331 0.237358 0.392436 0.337355
chargesum: 0.00000
title: Mulliken charges with hydrogens summed into heavy atoms:
elementType: O O O N C C C C C C C C C C C C C C C
charge: -0.100425 -0.292222 -0.112288 -0.040821 0.240015 0.123470 0.055011 0.241806 -0.129574 -0.054445 0.131631 -0.013768 0.085322 -0.164730 -0.138035 0.137405 0.017088 0.013229 0.001331
polarizability: 2.56244770e+02 1.82483396e+01 1.94197883e+02 -2.75448297e+00 -1.04745048e+00 1.02444229e+02
1716.lowfreq: -7.6815 -6.0429 0.0006 0.0008 0.0009 2.8714 24.9484 35.7196 52.5651
frequency: 24.7379 35.6905 52.5566 64.9494 76.3899 80.2336 114.8602 154.2028 180.8294 223.9327 246.3335 272.1959 293.3585 323.6193 336.3918 353.5921 372.9140 395.6153 403.1024 473.4709 493.5752 505.3901 530.6925 555.7369 562.3082 583.9673 615.5687 633.6418 708.2046 712.7010 727.6543 732.6843 756.0169 765.8515 804.7787 818.4591 824.3680 857.9393 866.0240 887.0595 931.9945 943.3433 983.9975 990.1551 999.6625 999.7161 1001.8887 1017.7218 1038.7276 1071.1241 1074.1636 1084.8828 1093.0644 1155.8366 1166.6703 1175.8148 1178.0720 1192.4271 1194.5460 1263.4202 1269.8963 1281.4345 1301.6331 1315.0809 1328.2561 1353.7037 1368.2931 1371.0985 1379.0242 1420.7110 1430.1545 1439.5841 1455.4114 1470.4826 1486.8296 1522.2835 1573.0086 1580.6995 1603.5284 1609.1069 1615.5414 2995.5483 3008.2967 3077.2705 3089.5269 3121.5874 3130.5899 3134.7444 3142.1591 3151.4683 3152.4168 3168.5484 3169.4653 3451.1679 3474.4667 3546.1600
redmass: 5.4095 5.1336 5.3911 6.0138 5.7037 4.6608 3.1237 4.4281 3.6797 4.6486 4.7088 5.9416 4.1636 4.8559 1.5086 3.7665 3.1341 3.3430 2.7406 3.2577 1.4529 2.5320 3.3959 4.7170 4.8808 4.2337 6.4100 6.3909 5.4890 1.9922 1.1291 4.9928 2.5677 1.6763 4.6550 1.9359 3.4552 2.9808 1.2473 2.6060 1.3482 1.3824 2.3768 2.0901 1.4697 2.2667 1.3106 3.5803 2.5720 2.1321 2.1478 1.7371 2.1874 2.1724 1.2452 1.0548 1.3679 1.2803 1.8234 1.4552 1.3708 2.0700 2.9596 1.4292 1.1575 1.3268 4.3417 1.2223 5.9732 3.0801 1.1830 2.4145 2.3923 1.0854 2.5763 1.8556 5.4371 5.9270 6.5164 6.0188 6.1380 1.0643 1.0595 1.1019 1.1033 1.0875 1.0865 1.0877 1.0915 1.0920 1.0951 1.1014 1.0991 1.0807 1.0654 1.0656
irintensity: 0.4265 0.1566 0.1544 4.4991 4.9160 2.0120 0.6624 1.4478 9.7276 5.9539 5.1653 10.0769 2.6109 3.9522 95.7521 11.8146 48.5240 42.9211 8.0615 4.8696 97.0722 14.8891 16.6078 3.4531 10.2941 0.7296 0.1873 9.5919 10.3050 45.4918 57.6826 4.1396 29.7458 81.3591 3.1434 15.8034 10.7674 23.6208 0.8545 21.1071 2.5107 2.1309 1.7442 0.5423 7.0289 55.3869 2.2451 15.2392 10.2349 45.0532 4.8593 2.1794 3.2111 29.0500 29.4053 0.1456 22.3477 5.2562 16.3507 36.0388 60.4783 12.4540 23.4122 11.6985 17.6440 8.1970 12.5660 24.9705 32.5278 34.9899 24.0784 19.7357 6.8559 10.1575 18.2036 331.1477 72.0872 25.5777 41.4869 4.4847 118.1749 33.9199 37.1333 17.7057 46.9471 4.8566 2.4412 6.4077 6.7783 3.6966 24.3548 22.7809 17.5789 181.2527 109.9899 1.4817
temp: 298.150 k
press: 1.00000 atm
elementType: 8 8 8 7 6 6 6 6 6 6 6 6 6 6 6 6 6 6 6 1 1 1 1 1 1 1 1 1 1 1 1 1 1 1
symmnumber: 1
zpe: 705605.4 jmol-1
zpe.correction: 0.268751 hartree
zpe.thermalcorrener: 0.285898 hartree
zpe.thermalcorrenthalpy: 0.286842 hartree
zpe.thermalcorrgfe: 0.222174 hartree
zpe.sumelectzpe: -859.668974 hartree
zpe.sumelectthermal: -859.651827 hartree
zpe.sumelectthermalent: -859.650883 hartree
zpe.sumelectthermalfe: -859.715551 hartree
dipole: -6.4245 -1.1211 1.0563
dipole: 6.6066
quadrupole: -110.9906 -110.6707 -112.1516
quadrupole: 2.6935 3.2661 -3.3452
quadrupole: 0.2804 0.6003 -0.8806 2.6935 3.2661 -3.3452
hfenergy: -859.9377248 hartree
pointgroup: C01 [X(C15H15N1O3)]
dipole: -2.4375298 0.3649925 -0.8254118 debye
polarizability: 252.1851478|-15.8181712|193.1902744|27.4524157|-5.7510067|107.5114599 unknown
InChI: InChI=1S/C15H15NO3/c17-10-9-16-15(19)13-8-4-7-12(14(13)18)11-5-2-1-3-6-11/h1-8,16-18H,9-10H2
charge 0 multiplicity 1
34 atoms
O  0.342262 0.865374 -0.587305
O  3.664402 -1.636038 0.344526
O  4.187205 2.480339 1.545542
N  2.973505 0.479504 -0.31669
C  -1.191031 -0.993685 -0.097393
C  1.273805 -1.273474 0.112538
C  0.134931 -0.471319 -0.175555
C  -2.374929 -0.134356 -0.406183
C  -1.355029 -2.355507 0.255113
C  1.056223 -2.626276 0.479975
C  2.720511 -0.827533 0.056478
C  -0.239727 -3.170669 0.545576
C  4.354041 0.977209 -0.439818
C  -2.553463 1.134239 0.219735
C  -3.36347 -0.578845 -1.326564
C  4.948609 1.385972 0.924296
C  -3.681357 1.933337 -0.076767
C  -4.491247 0.218288 -1.617262
C  -4.652033 1.48083 -0.999001
H  -2.37037 -2.761813 0.324662
H  1.947689 -3.221905 0.702571
H  -0.383976 -4.217775 0.82893
H  4.340024 1.85349 -1.111833
H  4.985936 0.186043 -0.884834
H  2.174793 1.066262 -0.584671
H  -1.846739 1.465147 0.990841
H  -3.232194 -1.546055 -1.824623
H  5.96601 1.787264 0.784731
H  4.996406 0.500413 1.587984
H  -3.80709 2.899765 0.423825
H  -5.240941 -0.141293 -2.330682
H  -5.526008 2.099969 -1.22808
H  -0.52153 1.291438 -0.834245
H  3.266083 2.150458 1.707584
