program: Gaussian 09
title: 000116138
version: EM64L-G09RevD.01
frameworkgroup: C1[X(C15H14INO3)]
method: RPBEPBE
basis: SDD
operation: Freq
keyword: #p
keyword: freq=noraman
keyword: PBEPBE/SDD
title: #p freq=noraman PBEPBE/SDD
converged: YES YES NO NO
title: Mulliken charges:
elementType: I O O O N C C C C C C C C C C C C C C C H H H H H H H H H H H H H H
charge: 0.093021 -0.408769 -0.369962 -0.447192 -0.402143 0.265145 0.163775 -0.004332 0.336313 -0.301259 -0.244102 0.226243 -0.436187 -0.351231 -0.397597 -0.352150 -0.318995 -0.239629 -0.239432 -0.239014 0.270333 0.211143 0.231392 0.244379 0.325244 0.238695 0.270553 0.229089 0.230430 0.226379 0.226672 0.229716 0.391851 0.341620
chargesum: 0.00000
title: Mulliken charges with hydrogens summed into heavy atoms:
elementType: I O O O N C C C C C C C C C C C C C C C
charge: 0.093021 -0.016918 -0.369962 -0.105572 -0.076900 0.265145 0.163775 -0.004332 0.336313 -0.030926 -0.032959 0.226243 -0.436187 0.124540 -0.158901 -0.081596 0.140523 -0.013250 -0.012760 -0.009298
polarizability: 3.02768886e+02 1.95207464e+01 2.56045500e+02 -7.65983300e+00 -8.19499803e+00 9.83911405e+01
1716.lowfreq: -7.9761 -5.5996 -4.0717 -0.0008 -0.0006 -0.0003 15.2120 30.6454 46.7703
frequency: 15.1938 30.6147 46.7586 52.1299 64.4402 77.0317 89.1589 108.5761 122.7078 156.3059 189.7887 210.2135 235.5682 242.7260 262.0037 284.1674 322.9125 358.9779 368.8636 401.1565 409.4622 436.8519 450.0602 502.1028 516.8549 543.3976 575.8764 596.7889 613.0215 618.0634 666.5978 698.0031 699.2259 738.3508 759.5794 780.6738 815.0195 819.7252 837.6563 847.0871 860.9398 897.6446 899.3445 925.1086 973.5986 977.3158 989.0261 994.6424 995.3112 1020.4636 1040.6480 1071.6018 1086.8126 1104.9363 1114.8961 1174.2145 1176.1656 1183.9701 1199.6086 1253.5267 1260.8349 1278.8813 1310.9308 1319.2800 1329.9833 1347.4025 1352.2028 1369.5867 1371.1552 1384.4890 1399.3862 1423.0647 1436.2089 1444.8317 1464.9738 1488.8957 1507.9177 1553.6253 1571.8578 1584.6613 1611.5209 1628.1577 2636.2056 2998.4007 3021.5208 3086.3152 3094.5510 3122.1199 3131.1894 3142.5820 3144.4652 3160.6876 3162.0010 3188.1628 3569.1537 3585.8583
redmass: 6.1424 6.1391 4.7892 4.6943 6.6694 4.8341 4.2874 5.9068 3.7360 5.7624 6.5020 5.6113 4.6169 5.0358 1.1602 4.8325 4.5838 6.3714 3.5953 3.3001 3.8533 6.4202 3.8706 2.0576 2.8861 2.5546 2.2024 5.7558 5.9703 6.1580 7.6544 6.8678 1.6878 5.0681 3.0004 2.6462 5.5259 3.1422 1.7331 1.2528 3.2914 2.7843 1.3994 1.4689 1.3875 1.0865 4.1198 2.2175 1.5735 3.8280 2.3931 2.0037 1.6735 3.9102 2.1314 1.0568 1.2518 2.1549 1.1459 2.2393 1.6766 1.7427 2.4622 1.4788 1.1876 1.9432 1.6549 1.5468 2.6904 3.0912 3.1760 2.4622 1.1576 2.4314 1.0836 2.3646 2.2173 6.1386 5.1574 5.7359 5.9963 2.7208 1.0736 1.0640 1.0590 1.1011 1.1058 1.0853 1.0882 1.0915 1.0940 1.0941 1.0976 1.0953 1.0664 1.0774
irintensity: 0.3144 4.9111 1.3680 5.8157 1.8632 0.4135 0.7285 2.6199 8.8040 2.5264 1.1814 2.2197 3.0170 5.5291 209.2331 5.0594 2.1838 0.3553 12.8468 11.7634 15.6032 5.7150 14.6577 5.2360 1.6182 12.9794 48.1002 6.8807 31.4156 10.3022 33.4188 2.9062 57.2030 12.4986 6.1021 54.0865 12.6656 5.7308 12.0751 1.4055 26.6339 28.3786 11.4527 0.8408 1.3644 131.7818 6.1547 57.1878 12.6194 14.1596 34.2450 0.5279 5.4558 5.4163 3.4492 0.1005 28.2551 15.4232 8.7322 21.7954 26.1540 15.1626 198.7093 61.7931 37.0966 96.4112 69.2374 10.5610 15.3446 10.9881 2.1778 236.7365 24.6428 90.0537 6.2521 1.0139 347.9302 184.6736 14.0298 5.3906 0.4486 26.6887 742.8695 29.2674 27.4155 24.3768 27.2202 5.6783 3.6185 8.3207 32.2636 4.0518 33.3217 5.6249 5.0405 27.0353
temp: 298.150 k
press: 1.00000 atm
elementType: 53 8 8 8 7 6 6 6 6 6 6 6 6 6 6 6 6 6 6 6 1 1 1 1 1 1 1 1 1 1 1 1 1 1
symmnumber: 1
zpe: 675809.5 jmol-1
zpe.correction: 0.257402 hartree
zpe.thermalcorrener: 0.276345 hartree
zpe.thermalcorrenthalpy: 0.277289 hartree
zpe.thermalcorrgfe: 0.206279 hartree
zpe.sumelectzpe: -870.510138 hartree
zpe.sumelectthermal: -870.491195 hartree
zpe.sumelectthermalent: -870.490251 hartree
zpe.sumelectthermalfe: -870.561262 hartree
dipole: 0.8519 0.9310 -0.5394
dipole: 1.3724
quadrupole: -123.3642 -134.5976 -134.1758
quadrupole: 0.2997 -7.6300 -3.7681
quadrupole: 7.3484 -3.8851 -3.4633 0.2997 -7.6300 -3.7681
hfenergy: -870.7675404 hartree
pointgroup: C01 [X(C15H14I1N1O3)]
dipole: 0.3546826 0.2808095 -0.2947544 debye
polarizability: 304.6457718|15.4210662|238.7475473|-9.4908694|-47.4576976|113.8122072 unknown
InChI: InChI=1S/C15H14INO3/c16-11-8-12(10-4-2-1-3-5-10)14(19)13(9-11)15(20)17-6-7-18/h1-5,8-9,17-19H,6-7H2
charge 0 multiplicity 1
34 atoms
I  0.297705 4.473964 -1.257802
O  -0.285708 -1.702969 0.119314
O  2.185966 -1.964125 -0.064223
O  5.845561 0.027294 1.417813
N  3.594712 -0.215001 -0.585502
C  -1.327778 0.448184 -0.261566
C  1.151375 0.196739 -0.432608
C  -0.149255 -0.37033 -0.180992
C  -2.701711 -0.090766 -0.040875
C  -1.16157 1.819622 -0.571497
C  1.266689 1.578214 -0.750005
C  2.333271 -0.704878 -0.35302
C  0.115939 2.373451 -0.813753
C  4.786955 -1.086766 -0.548749
C  -3.791427 0.42658 -0.797516
C  -2.9741 -1.091324 0.933319
C  5.361862 -1.249317 0.873105
C  -5.108908 -0.028068 -0.581013
C  -4.2936 -1.540156 1.153266
C  -5.367958 -1.012235 0.400783
H  -2.045215 2.463586 -0.594095
H  2.240143 2.039268 -0.943139
H  5.553669 -0.638187 -1.204131
H  4.506507 -2.07959 -0.943411
H  3.722172 0.763536 -0.839245
H  -3.603017 1.166386 -1.584449
H  -2.150407 -1.517468 1.509737
H  6.250737 -1.900392 0.831138
H  4.606612 -1.717499 1.534093
H  -5.929253 0.377114 -1.183848
H  -4.481793 -2.306952 1.913047
H  -6.390203 -1.368395 0.57037
H  0.673811 -2.118536 0.100744
H  5.068816 0.566116 1.712211
