program: Gaussian 09
title: 000116137
version: EM64L-G09RevD.01
frameworkgroup: C1[X(C15H23NO3)]
method: RPBEPBE
basis: SDD
operation: Freq
keyword: #p
keyword: freq=noraman
keyword: PBEPBE/SDD
title: #p freq=noraman PBEPBE/SDD
converged: YES YES NO NO
title: Mulliken charges:
elementType: O O O N C C C C C C C C C C C C C C C H H H H H H H H H H H H H H H H H H H H H H H
charge: -0.412230 -0.372656 -0.449167 -0.406218 -0.239899 0.462434 -0.272543 0.620243 -0.675581 -0.107735 0.186012 -0.568658 -0.699951 -0.700521 -0.692132 -0.694957 0.200786 -0.352697 -0.319522 0.272510 0.215494 0.243053 0.192777 0.204978 0.214078 0.230089 0.229246 0.214322 0.204909 0.203714 0.215116 0.230129 0.229851 0.216109 0.201680 0.320573 0.389731 0.225022 0.240764 0.225570 0.234700 0.340578
chargesum: 0.00000
title: Mulliken charges with hydrogens summed into heavy atoms:
elementType: O O O N C C C C C C C C C C C C C C C
charge: -0.022499 -0.372656 -0.108588 -0.085645 0.032611 0.462434 -0.057048 0.620243 -0.432528 -0.107735 0.186012 -0.375882 -0.050805 -0.052045 -0.043174 -0.047318 0.200786 0.113090 0.140748
polarizability: 2.37906995e+02 3.22084206e+00 2.03051728e+02 -1.08507111e+01 1.73060979e+00 1.26148371e+02
1716.lowfreq: -7.7752 -4.5054 -0.0003 0.0006 0.0006 4.8761 6.3873 20.2491 26.1007
frequency: -5.8351 20.0698 25.9866 38.5115 57.9767 85.0354 102.8439 111.0481 124.7277 140.3306 156.1213 207.7243 214.9733 220.2415 230.8592 239.8729 248.5157 249.7177 266.6746 277.8723 303.9473 331.3458 360.0063 379.1780 415.6855 420.4440 434.3304 439.3705 494.1418 508.7231 536.5861 544.0719 565.5782 627.3255 631.6300 716.1413 726.7683 760.7110 782.0997 821.8002 844.1199 860.7756 865.9492 877.9810 911.7560 921.2672 925.1846 931.2134 945.1228 947.8932 953.5404 956.2161 998.3737 1056.9127 1076.6871 1079.3355 1088.5608 1115.1501 1115.2626 1131.1284 1158.1108 1172.6728 1176.8243 1214.6983 1235.2521 1260.6241 1278.7091 1291.2143 1307.0662 1320.0014 1329.4082 1332.5863 1341.5501 1350.1018 1363.0253 1374.2587 1376.2374 1376.9140 1395.0437 1396.4896 1409.6949 1424.5199 1435.9457 1453.8725 1466.3132 1466.5169 1466.6201 1467.4729 1468.4148 1479.1596 1479.4085 1486.2539 1487.5567 1511.5389 1558.7962 1608.7799 1635.1574 2740.3831 2971.2231 2972.3203 2973.8830 2975.2888 2979.8295 3001.7531 3016.7997 3032.3257 3061.9175 3063.3020 3071.2389 3073.8676 3076.9714 3077.9144 3081.6216 3081.8964 3083.5983 3093.3166 3101.3235 3111.3783 3564.9699 3586.7697
redmass: 2.7025 3.4775 3.4511 5.4040 5.3680 3.2517 2.9291 4.6321 2.9618 3.1974 4.3280 1.4924 1.3374 1.3532 2.2769 1.4378 1.9166 1.5836 1.6698 1.3315 2.7396 3.5382 2.9917 3.5503 3.8855 3.4801 3.7319 4.4914 2.4057 3.0441 3.7060 1.4518 3.5446 3.3317 2.8569 5.5339 4.6021 4.3010 3.9962 2.9497 3.0382 3.4438 1.8927 2.5377 1.2355 1.2101 1.4362 2.5329 2.4887 1.0685 1.4712 1.4036 2.8109 2.3741 1.7512 2.1795 1.6107 2.5238 2.7380 2.4007 2.0349 1.2649 2.0597 1.6985 2.1489 1.3034 2.7087 1.7770 1.3269 1.7498 1.1931 1.2760 2.4139 1.3872 1.5575 1.4197 1.1941 1.1968 1.2140 1.2327 2.5222 2.5573 1.2245 2.4678 1.0522 1.0814 1.0500 1.0462 1.0460 1.0534 1.0526 1.0664 1.0792 2.1743 5.6234 3.4846 3.9852 1.0717 1.0350 1.0351 1.0357 1.0366 1.0830 1.0633 1.0592 1.0859 1.0997 1.0996 1.0988 1.0975 1.1003 1.1005 1.0993 1.0998 1.1020 1.1050 1.0892 1.0904 1.0662 1.0774
irintensity: 0.0095 0.2617 0.0823 2.3245 8.2622 0.5851 0.1624 0.3347 1.9897 7.5766 1.4867 0.2715 0.3585 0.5738 2.6564 0.3385 1.2417 7.1377 35.5102 153.9452 8.9955 1.1743 20.9569 15.8602 0.1897 2.6121 10.9730 4.8183 3.6743 1.7164 5.4224 27.4554 12.8729 5.8182 15.3499 0.7782 16.5180 18.4751 20.0586 6.0118 7.2600 14.6263 9.0467 2.8047 0.1683 4.6299 11.3790 19.1559 18.3263 126.0584 0.1778 3.1377 79.0204 20.5916 3.9259 8.6471 18.7597 1.8201 2.3993 1.4832 1.7130 22.5784 34.6929 13.1040 1.6717 10.7680 60.4138 157.8174 0.9921 67.0519 20.0122 0.3344 55.7702 13.6409 115.0999 12.2777 10.9097 20.9125 26.7247 1.9588 21.8256 28.9799 15.6044 171.0563 1.8417 7.2072 0.3269 3.4940 6.0307 23.2219 10.7877 41.8203 25.2829 386.3943 81.2989 1.1520 55.9722 563.9351 29.1647 31.4732 40.4391 28.5769 17.0449 29.5419 30.6440 2.6863 1.7874 2.6520 102.6290 97.2961 19.2995 26.8461 40.6259 35.9499 16.6144 37.1218 31.3016 15.3275 3.8076 20.9449
temp: 298.150 k
press: 1.00000 atm
elementType: 8 8 8 7 6 6 6 6 6 6 6 6 6 6 6 6 6 6 6 1 1 1 1 1 1 1 1 1 1 1 1 1 1 1 1 1 1 1 1 1 1 1
symmnumber: 1
zpe: 930527.9 jmol-1
zpe.correction: 0.354419 hartree
zpe.thermalcorrener: 0.374960 hartree
zpe.thermalcorrenthalpy: 0.375905 hartree
zpe.thermalcorrgfe: 0.304218 hartree
zpe.sumelectzpe: -864.375839 hartree
zpe.sumelectthermal: -864.355298 hartree
zpe.sumelectthermalent: -864.354354 hartree
zpe.sumelectthermalfe: -864.426040 hartree
dipole: -0.7396 3.5242 -0.6921
dipole: 3.6669
quadrupole: -116.7100 -117.7291 -118.0445
quadrupole: -1.9813 -8.8364 -2.2495
quadrupole: 0.7845 -0.2346 -0.5500 -1.9813 -8.8364 -2.2495
hfenergy: -864.7302584 hartree
pointgroup: C01 [X(C15H23N1O3)]
dipole: 0.1119137 -1.4019898 -0.3212577 debye
polarizability: 238.6875363|-1.4127923|202.9038507|7.2445907|-0.5009561|125.5157057 unknown
InChI: InChI=1S/C15H23NO3/c1-9(2)11-7-12(10(3)4)14(18)13(8-11)15(19)16-5-6-17/h7-10,16-18H,5-6H2,1-4H3
charge 0 multiplicity 1
42 atoms
O  0.642631 2.534069 -0.165541
O  -1.837388 2.254467 -0.454672
O  -5.044383 0.135562 1.535691
N  -2.863282 0.191519 -0.53983
C  3.279485 1.494848 0.1469
C  2.057223 0.588684 -0.006887
C  1.246538 -3.206404 -0.149456
C  1.05454 -1.686401 -0.148044
C  2.169628 -0.815532 -0.0061
C  0.756872 1.15748 -0.158185
C  -0.397618 0.307681 -0.296823
C  -0.218254 -1.103141 -0.291059
C  4.273684 1.3066 -1.030098
C  3.984261 1.267139 1.510624
C  0.849945 -3.834972 -1.512389
C  0.482201 -3.890561 1.015117
C  -1.725432 0.959155 -0.435664
C  -4.197319 0.799096 -0.716602
C  -4.819271 1.2613 0.616966
H  2.914751 2.536778 0.120951
H  2.327164 -3.401866 0.003598
H  3.166383 -1.261861 0.107546
H  -1.082096 -1.7719 -0.403868
H  4.67605 0.27606 -1.058284
H  5.128843 1.999792 -0.924181
H  3.784713 1.508111 -2.000042
H  3.28895 1.438819 2.351868
H  4.837963 1.961403 1.621529
H  4.375681 0.235616 1.596083
H  -0.22703 -3.688364 -1.719507
H  1.046943 -4.923217 -1.512585
H  1.417659 -3.378798 -2.34308
H  0.787109 -3.474808 1.992212
H  0.678311 -4.978903 1.023548
H  -0.610653 -3.749035 0.913721
H  -2.786485 -0.824238 -0.552496
H  -0.365897 2.748631 -0.289777
H  -4.852736 0.04379 -1.18452
H  -4.104411 1.668289 -1.39273
H  -5.820498 1.682033 0.426737
H  -4.182369 2.042013 1.075981
H  -4.168407 -0.15933 1.891649
