program: Gaussian 09
title: 000116136
version: EM64L-G09RevD.01
frameworkgroup: C1[X(C17H19NO2)]
method: RPBEPBE
basis: SDD
operation: Freq
keyword: #p
keyword: freq=noraman
keyword: PBEPBE/SDD
title: #p freq=noraman PBEPBE/SDD
converged: YES YES NO NO
title: Mulliken charges:
elementType: O O N C C C C C C C C C C C C C C C C C H H H H H H H H H H H H H H H H H H H
charge: -0.412859 -0.278707 -0.112907 -0.340887 -0.358197 0.176794 0.106353 0.243583 -0.032499 0.249389 -0.364700 -0.388355 -0.659696 -0.653386 -0.253008 -0.447805 -0.399417 -0.222932 -0.223624 -0.239387 0.256748 0.199426 0.261184 0.212442 0.258763 0.248801 0.207086 0.255392 0.210526 0.213359 0.231159 0.214839 0.230162 0.292139 0.251545 0.233279 0.230106 0.370648 0.234645
chargesum: 0.00000
title: Mulliken charges with hydrogens summed into heavy atoms:
elementType: O O N C C C C C C C C C C C C C C C C C
charge: -0.042211 -0.278707 -0.112907 0.115287 0.115429 0.176794 0.106353 0.243583 -0.032499 0.249389 -0.105937 -0.139554 0.013308 0.005972 -0.022846 -0.155666 -0.147873 0.010347 0.006482 -0.004742
polarizability: 2.62524905e+02 1.50658851e+01 1.94372245e+02 -1.72420149e+01 5.81556099e+00 1.47161545e+02
1716.lowfreq: -12.5172 -6.4675 -3.7464 -0.0004 0.0003 0.0005 27.4928 31.0581 40.1575
frequency: 27.3420 30.7966 40.1179 54.9477 60.3756 70.8115 85.5271 111.9025 126.3164 183.9269 188.3445 202.5390 218.9520 252.5520 273.1688 285.7874 303.9383 321.8847 342.8607 384.1844 402.9576 432.1620 479.0880 497.7587 505.7971 529.3337 543.9786 569.6350 596.5408 615.3237 621.5635 653.4946 708.7974 712.9395 752.1787 759.6790 766.8259 772.7469 785.6096 807.1178 811.2717 865.1339 876.3823 915.8030 933.5927 940.8281 969.4209 982.9742 989.6024 1000.7380 1001.4690 1022.4374 1056.3484 1069.4017 1073.5938 1080.4171 1082.5587 1097.9172 1114.1279 1170.3696 1174.6650 1190.1595 1195.0078 1207.5386 1216.4732 1264.2696 1279.5354 1299.4723 1304.4501 1316.2764 1338.1852 1354.8603 1368.1202 1376.3557 1383.3156 1385.5440 1417.9276 1421.5112 1439.0359 1451.8409 1463.5710 1464.7845 1467.1416 1474.2438 1481.8928 1485.8596 1487.5312 1556.3690 1577.3741 1591.1242 1609.3735 1610.6981 2981.3425 2985.3879 3000.6181 3006.8377 3066.0906 3073.8168 3082.8883 3084.6367 3103.7936 3112.2277 3121.1819 3127.8347 3132.9057 3140.4067 3146.7678 3150.2574 3166.4674 3167.6909 3485.6618
redmass: 3.8021 3.2519 4.2319 2.6686 3.2875 4.6374 5.6929 4.1604 3.1605 3.0319 3.5824 1.1326 1.4844 5.6952 3.5589 4.3494 2.9927 3.7006 3.6228 3.5425 2.6878 3.1842 4.5248 4.1367 1.1900 4.2179 3.0868 5.7785 4.0892 5.9835 5.6342 5.2238 6.9383 2.0032 2.3498 1.8227 1.6368 1.2033 1.7870 2.3930 5.8812 1.2474 2.7659 1.3785 1.3765 2.0577 1.3527 2.1822 2.2244 1.3335 3.1169 2.6954 2.4719 2.0751 2.2221 1.8138 1.6876 1.7990 1.8620 1.2086 1.0544 1.5697 1.3345 2.7144 2.4417 1.4840 1.5568 1.5048 2.2196 1.4189 1.2645 1.3016 4.2698 6.0217 1.2176 1.2151 2.5291 2.9708 2.5318 1.1437 2.2861 1.1083 1.0456 1.1244 1.0657 1.0947 2.5768 6.0436 5.6178 6.4258 6.0665 6.8539 1.0353 1.0357 1.0681 1.0635 1.1009 1.0988 1.0996 1.0983 1.1015 1.0952 1.0870 1.0865 1.0868 1.0916 1.0916 1.0961 1.1015 1.0995 1.0652
irintensity: 1.6085 0.0938 0.9114 0.5580 1.2332 1.7442 1.0434 1.6405 0.5854 0.0512 0.7343 0.2156 1.1729 0.2506 0.8926 3.5085 1.4457 1.1204 3.0451 15.6485 3.1229 6.6446 2.9182 0.6128 91.0181 23.0174 8.6598 5.6492 7.1001 4.8107 8.5859 1.8357 9.2272 32.3372 14.3760 43.7676 56.4968 5.2753 4.7229 15.8776 9.2324 0.4138 23.6689 0.5722 3.3593 8.9049 1.0127 1.4445 0.1605 0.9101 0.9221 4.9074 10.7992 9.6115 31.1419 2.3748 16.5349 21.7226 68.3790 39.2389 0.0761 35.7670 18.1980 10.9178 10.7362 24.8137 83.9197 3.7886 37.2417 14.2459 8.7907 7.1808 11.3133 16.4195 7.5125 36.3725 114.3140 33.4337 29.5594 31.3307 7.5048 7.0648 10.0967 17.2253 8.4862 11.5890 15.3605 241.7992 10.2899 29.4160 4.1003 24.5843 25.3550 28.9996 26.1083 46.5243 4.9819 22.0134 46.1116 35.1174 26.4306 30.9013 4.8171 1.8683 3.7972 9.2836 5.8681 27.8469 28.6948 15.6067 90.7198
temp: 298.150 k
press: 1.00000 atm
elementType: 8 8 7 6 6 6 6 6 6 6 6 6 6 6 6 6 6 6 6 6 1 1 1 1 1 1 1 1 1 1 1 1 1 1 1 1 1 1 1
symmnumber: 1
zpe: 836940.4 jmol-1
zpe.correction: 0.318774 hartree
zpe.thermalcorrener: 0.338169 hartree
zpe.thermalcorrenthalpy: 0.339113 hartree
zpe.thermalcorrgfe: 0.269241 hartree
zpe.sumelectzpe: -862.966373 hartree
zpe.sumelectthermal: -862.946978 hartree
zpe.sumelectthermalent: -862.946034 hartree
zpe.sumelectthermalfe: -863.015906 hartree
dipole: -2.9228 -1.0606 4.1350
dipole: 5.1736
quadrupole: -104.4004 -109.5398 -124.0795
quadrupole: 0.4213 8.3188 3.4026
quadrupole: 8.2728 3.1334 -11.4062 0.4213 8.3188 3.4026
hfenergy: -863.2851463 hartree
pointgroup: C01 [X(C17H19N1O2)]
dipole: -1.1074754 0.43848 -1.6505275 debye
polarizability: 262.1709579|-13.7059739|192.9497387|20.4532424|7.565553|148.9379979 unknown
InChI: InChI=1S/C17H19NO2/c1-3-18(4-2)17(20)15-12-8-11-14(16(15)19)13-9-6-5-7-10-13/h5-12,19H,3-4H2,1-2H3
charge 0 multiplicity 1
39 atoms
O  0.074967 1.166775 0.145451
O  3.016119 -0.438733 1.916437
N  3.146291 0.4743 -0.218413
C  4.41783 1.145958 0.147126
C  2.670957 0.626276 -1.610657
C  1.188879 -0.947507 0.428754
C  2.505067 -0.267814 0.758837
C  -1.268196 -0.914247 0.06952
C  -0.020431 -0.236037 0.221963
C  -2.539212 -0.151467 -0.114918
C  1.140208 -2.361184 0.488438
C  -1.266571 -2.331328 0.09136
C  4.182355 2.551256 0.740706
C  3.34115 -0.368013 -2.585004
C  -0.073613 -3.055463 0.298722
C  -2.895378 0.909147 0.768719
C  -3.436207 -0.484441 -1.166676
C  -4.105367 1.618557 0.594045
C  -4.646618 0.221527 -1.336056
C  -4.983705 1.280947 -0.460919
H  4.932741 0.512239 0.889392
H  5.046663 1.203822 -0.76067
H  1.578384 0.504276 -1.633984
H  2.877748 1.666783 -1.926974
H  2.065798 -2.905925 0.701831
H  -2.220313 -2.860184 -0.016312
H  3.636017 3.201519 0.033309
H  3.591593 2.472224 1.668544
H  5.1477 3.034282 0.980586
H  4.442065 -0.271687 -2.568284
H  3.08261 -1.40792 -2.317788
H  2.998284 -0.18062 -3.619622
H  -0.093533 -4.149074 0.337519
H  -2.259831 1.130801 1.635111
H  -3.169537 -1.290314 -1.859869
H  -4.367108 2.422595 1.290934
H  -5.323873 -0.049435 -2.153726
H  -0.822205 1.56083 -0.02298
H  -5.92173 1.830475 -0.595152
