program: Gaussian 09
title: 000116133
version: EM64L-G09RevD.01
frameworkgroup: C1[X(C13H20ClN)]
method: RPBEPBE
basis: SDD
operation: Freq
keyword: #p
keyword: freq=noraman
keyword: PBEPBE/SDD
title: #p freq=noraman PBEPBE/SDD
converged: YES YES NO NO
title: Mulliken charges:
elementType: Cl N C C C C C C C C C C C C C H H H H H H H H H H H H H H H H H H H H
charge: -0.087311 -0.113065 -0.382440 -0.397233 -0.540681 -0.314994 -0.331907 0.510678 -0.581244 -0.664129 -0.429389 -0.398181 -0.224977 -0.230091 -0.244987 0.211529 0.202889 0.214455 0.214647 0.226393 0.195130 0.228422 0.231821 0.209188 0.197768 0.262561 0.265193 0.208664 0.223967 0.211661 0.229131 0.223699 0.222438 0.223709 0.226686
chargesum: 0.00000
title: Mulliken charges with hydrogens summed into heavy atoms:
elementType: Cl N C C C C C C C C C C C C C
charge: -0.087311 -0.113065 0.031977 0.031869 -0.119158 0.145250 0.075049 0.510678 -0.053490 -0.019837 -0.200258 -0.174482 -0.002539 -0.006382 -0.018302
polarizability: 1.88218713e+02 -1.88285777e+00 1.74672177e+02 -2.97801209e+00 -4.51060790e+00 1.04368886e+02
1716.lowfreq: -13.9588 -8.4119 -7.1111 0.0009 0.0026 0.0027 11.5379 18.6176 27.1999
frequency: 11.1627 18.2670 26.8975 44.5568 49.4507 77.0447 93.9374 97.1631 154.6136 194.8304 239.8549 253.2778 260.6693 298.8195 335.6761 347.5713 396.4210 403.4109 460.9163 484.9754 497.0568 595.8058 617.4053 643.6042 705.1724 729.4224 751.8203 769.2876 791.8679 797.1890 810.0116 851.6804 873.7471 909.1228 925.6165 973.1709 986.5394 989.7368 991.8523 1006.8172 1025.5136 1038.5996 1046.6990 1069.8975 1082.0077 1084.4269 1093.3917 1106.0486 1137.0378 1170.9024 1185.3835 1200.8910 1215.5855 1220.0508 1238.6797 1259.6611 1273.2929 1284.3544 1298.0890 1301.9725 1325.4613 1345.0556 1358.9142 1363.7044 1373.8069 1381.3017 1383.9985 1438.8308 1448.7891 1459.4830 1462.6476 1471.4856 1478.1366 1480.3113 1482.9190 1484.8867 1489.1350 1591.5705 1613.5448 2868.4638 2877.1242 2938.3205 2976.5900 2983.1298 2984.2367 3019.2861 3021.1837 3033.4301 3050.3299 3053.7282 3061.2408 3077.5236 3090.7248 3108.4083 3113.1016 3129.5865 3141.3898 3148.0919 3160.9626
redmass: 6.6330 3.9338 3.5707 3.3935 2.3511 3.0206 3.4258 2.4976 2.3484 2.3720 1.8328 2.6340 3.1441 2.5100 2.4401 2.9377 2.4688 2.8153 2.9788 3.0624 3.0596 3.8414 6.3620 5.9149 1.7382 2.0098 1.9696 1.1391 1.1604 1.8196 2.4305 1.2503 2.1257 1.5246 1.7935 1.3913 2.0955 6.1270 1.3244 1.3761 2.1926 1.9245 2.9110 3.2314 2.1248 2.0754 1.6834 1.6589 1.3046 1.0524 1.1129 1.5762 2.3134 1.9183 1.1945 1.4456 1.1775 1.1967 1.3311 1.2838 1.2634 1.4269 1.3342 1.3490 1.3470 6.9789 1.2513 2.1768 1.0934 1.0612 1.0841 1.0653 1.0716 1.2020 1.9157 1.0876 1.0810 6.0391 6.1958 1.0711 1.0710 1.0685 1.0600 1.0567 1.0390 1.0949 1.0895 1.0923 1.0998 1.0941 1.0582 1.0985 1.1004 1.0876 1.0867 1.0901 1.0956 1.1122 1.1014
irintensity: 0.2740 0.0173 0.0064 0.1992 0.4058 1.8839 0.5104 1.1578 1.7989 1.7190 1.3450 2.7041 1.9978 2.0357 0.2962 2.1151 4.9842 0.0158 2.3805 5.0236 12.8786 6.9618 0.1547 98.7141 49.8085 10.6807 43.2880 7.6814 8.3687 7.6402 1.1245 0.0251 2.2886 0.2560 5.0888 0.0943 2.9976 0.0153 0.0988 5.4141 6.2572 9.9777 8.6893 3.7246 5.2834 34.1918 13.9044 31.7504 1.9262 0.0383 0.2632 35.0659 1.8009 22.0383 33.5514 2.4587 1.2277 4.1760 13.3992 17.0078 1.1701 2.8681 1.9540 6.6377 7.5251 0.1856 24.0642 6.6974 6.4997 4.0367 3.4864 4.0442 14.4918 13.6461 19.0559 15.0214 11.3391 1.2300 13.4933 47.4026 163.2571 63.2338 4.1203 27.5899 51.7536 10.3450 10.1405 18.4843 50.8693 24.1663 22.0574 58.9519 42.6174 16.5281 9.5050 9.2298 47.4347 23.9372 24.6862
temp: 298.150 k
press: 1.00000 atm
elementType: 17 7 6 6 6 6 6 6 6 6 6 6 6 6 6 1 1 1 1 1 1 1 1 1 1 1 1 1 1 1 1 1 1 1 1
symmnumber: 1
zpe: 789952.6 jmol-1
zpe.correction: 0.300877 hartree
zpe.thermalcorrener: 0.317549 hartree
zpe.thermalcorrenthalpy: 0.318493 hartree
zpe.thermalcorrgfe: 0.251703 hartree
zpe.sumelectzpe: -1021.012095 hartree
zpe.sumelectthermal: -1020.995423 hartree
zpe.sumelectthermalent: -1020.994479 hartree
zpe.sumelectthermalfe: -1021.061269 hartree
dipole: -0.0092 -3.1157 0.3582
dipole: 3.1363
quadrupole: -98.3591 -100.7282 -101.2875
quadrupole: -9.8529 -2.0641 -2.4158
quadrupole: 1.7658 -0.6033 -1.1625 -9.8529 -2.0641 -2.4158
hfenergy: -1021.3129719 hartree
pointgroup: C01 [X(C13H20Cl1N1)]
dipole: -0.1880412 1.2114529 0.1397841 debye
polarizability: 188.5127224|0.5447405|174.4895188|-0.9931738|4.4270608|104.2575348 unknown
InChI: InChI=1S/C13H20ClN/c1-2-15(12-10-14)11-6-9-13-7-4-3-5-8-13/h3-5,7-8H,2,6,9-12H2,1H3
charge 0 multiplicity 1
35 atoms
Cl -3.094585 -3.67668 0.170421
N  -2.545504 0.434966 0.336529
C  -1.681885 1.221911 1.253152
C  -0.198987 0.789187 1.211313
C  0.470235 1.068952 -0.161488
C  -2.846232 -0.936978 0.806455
C  -3.734929 1.163942 -0.178021
C  1.88042 0.505779 -0.248634
C  -2.632932 -1.910012 -0.360775
C  -3.388443 2.215531 -1.249427
C  3.016838 1.329968 -0.043143
C  2.090379 -0.875652 -0.503551
C  4.324194 0.7928 -0.087609
C  3.393571 -1.41835 -0.549442
C  4.517517 -0.584788 -0.340062
H  -2.053337 1.164228 2.305894
H  -1.749223 2.284296 0.952829
H  -0.113772 -0.290818 1.444452
H  0.352211 1.321899 2.011896
H  -0.177948 0.628125 -0.942991
H  0.486427 2.163273 -0.333489
H  -3.883959 -1.036282 1.19474
H  -2.168152 -1.212526 1.633573
H  -4.415987 0.416138 -0.6265
H  -4.304006 1.646974 0.65516
H  -3.280914 -1.685685 -1.221244
H  -1.579149 -1.95279 -0.671448
H  -2.730554 3.009742 -0.852403
H  -2.869609 1.738756 -2.099436
H  -4.309288 2.701135 -1.622589
H  2.874912 2.401171 0.14912
H  1.224289 -1.528753 -0.674392
H  5.189216 1.44723 0.070849
H  3.534167 -2.486447 -0.751786
H  5.529719 -1.003044 -0.377252
