program: Gaussian 09
title: 000116122
version: EM64L-G09RevD.01
frameworkgroup: C1[X(C9H11F3O6)]
method: RPBEPBE
basis: SDD
operation: Freq
keyword: #p
keyword: freq=noraman
keyword: PBEPBE/SDD
title: #p freq=noraman PBEPBE/SDD
converged: YES YES NO NO
title: Mulliken charges:
elementType: F F F O O O O O O C C C C C C C C C H H H H H H H H H H H
charge: -0.215490 -0.227333 -0.219564 -0.265772 -0.272196 -0.251073 -0.200727 -0.186992 -0.227126 -0.179404 -0.520410 -0.540258 0.239350 0.259479 0.293545 -0.101878 -0.095220 -0.106890 0.310671 0.264872 0.259511 0.269892 0.298511 0.227539 0.240526 0.225039 0.247585 0.223315 0.250499
chargesum: 0.00000
title: Mulliken charges with hydrogens summed into heavy atoms:
elementType: F F F O O O O O O C C C C C C C C C
charge: -0.215490 -0.227333 -0.219564 -0.265772 -0.272196 -0.251073 -0.200727 -0.186992 -0.227126 0.131266 0.003974 0.028145 0.239350 0.259479 0.293545 0.366187 0.377404 0.366924
polarizability: 1.44199256e+02 3.71756653e+00 1.14927329e+02 -1.82730099e+00 -3.96876082e+00 9.32377150e+01
1716.lowfreq: -6.7985 -2.0830 -0.0004 0.0004 0.0004 4.9177 22.6606 27.8651 38.7554
frequency: 22.5643 27.8609 38.7114 39.9270 59.5913 65.6451 66.0006 76.2777 86.9702 96.3766 100.0868 118.1295 147.6693 191.2409 239.3667 263.8467 285.5578 299.3554 324.3167 358.6955 376.0093 404.5939 475.1046 485.0652 518.2775 550.1402 619.3051 624.3601 633.8621 691.6297 709.1624 760.0364 822.6655 862.2176 889.3045 906.4919 917.5646 926.7754 933.4541 978.5573 982.7057 991.1224 1027.5938 1087.8233 1100.0235 1100.3730 1104.7303 1112.7951 1114.9174 1143.0718 1192.0400 1226.9731 1228.4929 1230.1469 1257.7254 1271.6594 1294.3900 1333.5751 1356.4624 1383.7754 1388.2795 1391.4471 1431.2922 1439.3962 1443.1658 1443.4469 1449.2870 1664.0512 1668.0151 1691.8915 2986.8364 3017.4424 3037.9461 3050.0483 3051.7096 3067.4816 3084.9128 3110.0099 3150.7655 3153.8262 3166.5579
redmass: 9.6648 6.5111 5.9214 7.9476 5.2746 9.1065 6.7410 9.4842 8.7959 10.2551 10.5842 6.2674 4.5691 6.5138 3.5228 5.5420 2.9681 3.7704 3.5934 5.0099 3.6751 4.0217 4.5492 6.7345 7.8349 4.1990 4.9268 5.5128 5.3811 6.0229 6.1119 5.4921 5.4804 2.4205 3.1748 8.7833 4.3013 7.4350 8.1434 4.0325 6.4907 8.1647 3.9408 2.4416 1.7568 1.6559 1.8012 3.0092 3.5230 2.9356 1.3494 1.0840 1.0834 1.0921 1.2809 1.3581 1.2747 1.4605 1.6067 1.1651 1.1618 1.1877 1.0857 1.0881 1.0859 1.0842 1.0922 9.8635 10.5273 10.3062 1.0814 1.0620 1.0591 1.0529 1.0536 1.0521 1.0989 1.1037 1.1167 1.1161 1.1181
irintensity: 2.2211 0.5671 0.7063 3.5346 1.6146 4.1658 10.0857 1.6393 0.2939 0.7132 3.5173 0.4599 0.5364 6.6063 3.7968 2.9975 31.3055 25.6658 6.2436 0.9270 2.9632 1.5341 48.5933 33.6049 0.0798 4.9089 3.6998 2.1277 2.0616 9.4779 13.2765 37.6896 12.3870 0.6517 30.0566 219.8733 134.5828 186.1648 359.6009 6.8960 62.8738 276.9791 65.1620 219.9525 55.2930 21.0590 10.1691 67.9016 202.3958 159.9699 26.7063 5.4454 5.2805 4.2902 112.5509 45.9216 25.9565 5.2016 22.6891 5.9010 6.4201 7.5776 33.6685 7.2052 17.4328 11.9514 19.3707 104.7176 161.7812 240.4249 18.7463 10.7707 3.6871 42.3751 35.5284 27.4706 1.2108 3.2737 7.2814 8.3300 8.2128
temp: 298.150 k
press: 1.00000 atm
elementType: 9 9 9 8 8 8 8 8 8 6 6 6 6 6 6 6 6 6 1 1 1 1 1 1 1 1 1 1 1
symmnumber: 1
zpe: 534856.2 jmol-1
zpe.correction: 0.203716 hartree
zpe.thermalcorrener: 0.223130 hartree
zpe.thermalcorrenthalpy: 0.224075 hartree
zpe.thermalcorrgfe: 0.151344 hartree
zpe.sumelectzpe: -1099.020539 hartree
zpe.sumelectthermal: -1099.001125 hartree
zpe.sumelectthermalent: -1099.000181 hartree
zpe.sumelectthermalfe: -1099.072911 hartree
dipole: -0.1632 -2.4406 -1.4084
dipole: 2.8225
quadrupole: -91.8051 -111.6156 -106.9130
quadrupole: -8.5756 -18.8820 4.1845
quadrupole: 11.6394 -8.1710 -3.4684 -8.5756 -18.8820 4.1845
hfenergy: -1099.2242553 hartree
pointgroup: C01 [X(C9H11F3O6)]
dipole: -0.0709541 -0.9386027 -0.5891868 debye
polarizability: 144.3540711|3.3526779|115.068231|-1.0021796|-3.1071256|92.9419984 unknown
InChI: InChI=1S/C9H11F3O6/c10-3-16-7(13)1-6(9(15)18-5-12)2-8(14)17-4-11/h6H,1-5H2
charge 0 multiplicity 1
29 atoms
F  -4.69959 1.513747 -0.975996
F  3.724299 -0.556361 -0.355454
F  2.675078 3.63021 0.569012
O  -3.098615 0.632079 0.50212
O  1.787364 -1.774568 -0.914249
O  1.664494 1.839357 -0.578293
O  -3.270732 -1.516388 -0.417795
O  1.387479 -2.776858 1.17542
O  1.235318 0.685931 1.416389
C  -1.05168 -0.620188 0.252025
C  -0.511421 -2.004891 -0.211266
C  -0.378239 0.590798 -0.449578
C  -2.562782 -0.603772 0.043436
C  0.939024 -2.235327 0.153554
C  0.898313 1.004451 0.260051
C  -4.514825 0.856528 0.296757
C  3.212583 -1.868702 -0.71638
C  2.914879 2.34193 -0.037897
H  -0.873549 -0.502735 1.341437
H  -1.106221 -2.797689 0.271515
H  -0.633657 -2.097005 -1.303272
H  -0.153678 0.379571 -1.508764
H  -1.056231 1.46446 -0.428115
H  -4.8279 1.552777 1.087656
H  -5.069115 -0.095984 0.262264
H  3.65419 -2.12846 -1.689107
H  3.458763 -2.554406 0.111158
H  3.57488 2.491405 -0.903648
H  3.309171 1.667888 0.737522
