program: Gaussian 09
title: 000116108
version: EM64L-G09RevD.01
frameworkgroup: C1[X(C13H17NO3)]
method: RPBEPBE
basis: SDD
operation: Freq
keyword: #p
keyword: freq=noraman
keyword: PBEPBE/SDD
title: #p freq=noraman PBEPBE/SDD
converged: YES YES NO NO
title: Mulliken charges:
elementType: O O O N C C C C C C C C C C C C C H H H H H H H H H H H H H H H H H
charge: -0.229282 -0.302436 -0.301471 -0.363791 -0.486734 -0.652767 -0.403302 0.253593 0.462329 -0.419465 -0.373977 -0.218943 -0.218080 0.290478 -0.240918 -0.215603 -0.675322 0.232560 0.271391 0.256110 0.212044 0.233636 0.253584 0.347440 0.232523 0.254993 0.228329 0.228598 0.231175 0.223649 0.225029 0.208166 0.228891 0.227571
chargesum: 0.00000
title: Mulliken charges with hydrogens summed into heavy atoms:
elementType: O O O N C C C C C C C C C C C C C
charge: -0.229282 -0.302436 -0.301471 -0.016351 0.017218 -0.184613 0.083918 0.253593 0.462329 -0.186942 -0.118984 0.009386 0.010518 0.290478 -0.009743 0.233075 -0.010694
polarizability: 1.34921682e+02 5.81285001e+00 1.72248012e+02 -1.46527492e+01 8.01280753e-01 1.41693572e+02
1716.lowfreq: -12.5875 -8.6423 -0.0007 0.0001 0.0003 4.9279 6.9905 11.4338 23.5567
frequency: 3.1429 10.6402 23.0960 30.0566 45.3029 58.1880 82.8168 100.8952 130.0507 147.5981 204.6308 212.7512 246.5445 286.9415 307.3953 321.6967 353.6870 402.8891 432.0803 448.2914 465.6512 486.4767 569.3797 616.5653 633.1424 654.1927 664.7459 700.6966 705.6289 736.6301 770.4131 791.9309 800.0144 831.7815 849.6454 854.8636 919.6479 929.3158 954.6492 979.2162 989.5858 991.4367 998.0114 1026.6524 1033.1120 1053.8235 1063.4672 1095.4928 1110.1806 1136.3799 1139.1605 1173.4302 1175.7696 1189.1434 1194.8997 1198.0179 1205.8397 1247.6214 1267.2427 1272.1559 1328.9457 1343.4344 1354.9922 1373.0861 1382.1336 1398.6735 1416.0233 1440.7576 1453.0907 1455.0914 1461.8631 1475.6264 1480.9928 1482.4477 1494.9133 1592.6485 1606.5755 1621.4542 1659.1825 2972.2269 2994.1679 3005.1042 3007.6272 3015.4390 3032.4740 3061.9608 3075.5490 3090.8306 3090.9998 3104.7591 3118.5969 3125.7159 3137.4322 3148.5163 3165.6665 3567.5293
redmass: 3.9796 4.8016 2.8847 2.9473 5.3100 5.3087 4.9123 3.7695 3.6036 3.8717 3.9913 4.1177 1.2023 3.9450 2.9502 3.3550 3.0888 2.8246 2.6083 2.9509 3.3752 3.7018 3.4065 6.1925 1.4235 3.0009 2.7253 8.6012 1.8593 2.7362 1.9694 3.7277 1.0948 3.1922 2.6959 1.2590 1.5787 2.0580 2.5044 1.3940 5.9241 2.3709 1.3237 2.2595 2.4260 2.7042 1.8550 1.6442 2.2467 3.4652 1.4663 1.0612 1.2908 1.1595 1.7285 2.4172 1.6972 1.1335 1.4437 1.3715 1.2793 1.7048 1.2951 1.3094 8.2601 1.2653 1.0961 2.1536 1.1049 1.1122 1.0409 1.1963 1.5528 1.8051 1.2376 6.2281 6.2478 7.3887 9.4080 1.0620 1.0357 1.0579 1.0585 1.0714 1.0866 1.1068 1.1040 1.1020 1.0987 1.1023 1.0873 1.0866 1.0916 1.0962 1.1016 1.0773
irintensity: 0.1495 0.1854 0.4403 0.5545 0.1992 5.7122 11.5510 2.1711 0.1956 5.9873 2.7343 6.6792 0.8365 2.4206 9.9971 3.8589 5.1889 0.0267 13.2735 1.4743 7.6653 8.6349 2.4965 0.1444 172.7225 13.3743 45.1253 24.6138 40.2009 18.5699 26.7028 2.9207 3.8392 3.8310 2.2639 0.1572 6.9566 15.9192 35.6045 0.0692 0.7208 11.0931 0.4331 5.7912 36.2466 42.3553 99.7980 35.6505 15.8279 75.9549 4.0550 1.2708 35.5704 1.0977 108.1797 27.8123 68.1709 0.1309 44.8199 88.4849 2.2679 74.0221 5.7897 3.1216 1.1533 30.7278 30.7660 6.8139 26.5355 28.8638 10.6905 106.5456 63.1416 81.2550 81.7716 8.5427 47.0849 59.6605 281.4534 16.5147 22.5306 27.3959 19.7171 10.3040 39.2250 11.9443 8.0547 1.1394 36.1208 48.5543 7.5950 0.3720 11.0107 32.4290 19.4015 52.4315
temp: 298.150 k
press: 1.00000 atm
elementType: 8 8 8 7 6 6 6 6 6 6 6 6 6 6 6 6 6 1 1 1 1 1 1 1 1 1 1 1 1 1 1 1 1 1
symmnumber: 1
zpe: 728892.0 jmol-1
zpe.correction: 0.277620 hartree
zpe.thermalcorrener: 0.295362 hartree
zpe.thermalcorrenthalpy: 0.296306 hartree
zpe.thermalcorrgfe: 0.225041 hartree
zpe.sumelectzpe: -784.742609 hartree
zpe.sumelectthermal: -784.724868 hartree
zpe.sumelectthermalent: -784.723924 hartree
zpe.sumelectthermalfe: -784.795189 hartree
dipole: -2.3085 0.5427 0.3708
dipole: 2.4002
quadrupole: -98.2862 -87.7044 -106.4416
quadrupole: 7.2282 -10.0334 -3.8067
quadrupole: -0.8088 9.7730 -8.9642 7.2282 -10.0334 -3.8067
hfenergy: -785.0202298 hartree
pointgroup: C01 [X(C13H17N1O3)]
dipole: 0.9172483 0.1003904 -0.2007699 debye
polarizability: 131.935482|2.5864224|171.9360342|-13.6372031|5.9862501|144.9917494 unknown
InChI: InChI=1S/C13H17NO3/c1-2-17-13(16)14-9-8-12(15)10-11-6-4-3-5-7-11/h3-7,14H,2,8-10H2,1H3
charge 0 multiplicity 1
34 atoms
O  0.216309 -2.396292 1.314266
O  -3.160957 0.807774 0.706663
O  -3.229804 0.103613 -1.546859
N  -2.185544 -1.165566 0.135763
C  -0.213086 -2.130116 -1.074274
C  2.193748 -2.000019 -0.056316
C  -1.717289 -2.240544 -0.742537
C  0.686135 -2.206878 0.157721
C  2.519135 -0.506429 -0.152018
C  2.997789 0.06076 -1.35944
C  2.326939 0.335501 0.97426
C  3.287145 1.442461 -1.440229
C  2.614868 1.715517 0.894202
C  -2.880856 -0.082985 -0.349242
C  3.096272 2.274101 -0.313331
C  -3.925376 2.023806 0.31767
C  -4.076381 2.865788 1.58148
H  0.080534 -2.944791 -1.769507
H  -0.000137 -1.183172 -1.609276
H  2.716103 -2.455926 0.80344
H  2.516226 -2.511265 -0.98156
H  -1.916712 -3.211318 -0.253899
H  -2.305056 -2.187355 -1.674212
H  -1.913993 -1.188265 1.120076
H  3.153257 -0.579822 -2.236463
H  1.948931 -0.094543 1.909471
H  3.661167 1.866828 -2.378711
H  2.463765 2.35445 1.771451
H  3.320322 3.344773 -0.374814
H  -4.901337 1.711621 -0.097263
H  -3.369311 2.553447 -0.477297
H  -4.644367 3.786316 1.353376
H  -4.618323 2.307183 2.363873
H  -3.089318 3.155247 1.981237
