program: Gaussian 09
title: 000116099
version: EM64L-G09RevD.01
frameworkgroup: C1[X(C10H20N2O2)]
method: RPBEPBE
basis: SDD
operation: Freq
keyword: #p
keyword: freq=noraman
keyword: PBEPBE/SDD
title: #p freq=noraman PBEPBE/SDD
converged: YES YES NO NO
title: Mulliken charges:
elementType: O O N N C C C C C C C C C C H H H H H H H H H H H H H H H H H H H H
charge: -0.317249 -0.309456 -0.083651 -0.143023 -0.335773 -0.353599 -0.398263 -0.390008 -0.299068 -0.378900 0.305458 -0.685593 -0.207541 -0.677608 0.209238 0.184213 0.189277 0.213954 0.252125 0.216622 0.220619 0.250986 0.170810 0.199040 0.216208 0.198871 0.208821 0.209608 0.220648 0.225705 0.224025 0.210280 0.225841 0.227384
chargesum: 0.00000
title: Mulliken charges with hydrogens summed into heavy atoms:
elementType: O O N N C C C C C C C C C C
charge: -0.317249 -0.309456 -0.083651 -0.143023 0.057677 0.049631 0.070484 0.081596 0.070782 0.036180 0.305458 -0.046515 0.242189 -0.014103
polarizability: 1.72046356e+02 2.49645831e-01 1.22669779e+02 3.94358247e+00 -2.32117274e+00 9.85390216e+01
1716.lowfreq: -5.4518 0.0002 0.0006 0.0007 3.3341 18.1013 32.8813 40.9041 63.3298
frequency: 30.5178 39.8976 63.2265 74.0891 80.4908 107.3810 119.5191 136.3436 199.7978 220.1731 226.6955 250.7505 256.5488 300.5003 315.0229 330.1407 361.2909 405.5411 423.0758 471.3013 511.0946 578.0108 631.0551 691.0293 752.7821 759.7550 775.0729 799.8377 841.2839 843.5995 878.9461 898.3238 955.4588 981.9017 1004.7241 1036.5189 1050.4902 1053.1948 1066.8132 1089.7234 1107.6144 1111.1618 1130.7843 1139.3085 1141.9746 1163.1746 1198.8461 1210.3941 1222.7184 1246.5867 1253.8690 1273.8081 1283.3863 1297.0363 1310.6879 1331.1712 1345.1653 1348.3547 1365.2587 1369.2017 1387.1006 1395.2263 1396.2298 1417.2285 1454.5084 1460.5630 1461.9598 1462.9741 1466.8628 1471.7820 1477.6827 1478.5646 1478.7406 1489.9300 1492.1606 1639.7765 2833.4368 2844.6223 2860.5110 2974.5182 2975.7432 2979.7977 2987.0061 2993.1527 3004.9490 3007.5124 3033.9049 3041.3755 3054.0308 3064.3423 3073.2285 3076.4345 3090.3815 3093.9134 3103.6747 3117.0903
redmass: 3.9795 2.1941 1.8504 2.5556 3.4901 4.0410 3.3161 3.4298 2.4076 2.2520 1.2269 1.2915 3.0859 2.5108 2.2953 3.4276 3.1744 2.0227 4.4302 2.7278 4.5645 3.5541 2.3942 10.8757 1.0955 4.0608 4.2479 1.0953 1.5665 3.1515 1.2416 1.8970 1.8862 2.8498 2.6274 2.5244 2.8039 1.7367 3.0072 2.2112 2.2896 2.1791 2.2108 1.4645 2.5180 2.4020 1.0975 2.1522 1.7834 1.1343 1.4616 1.5962 1.3096 1.2298 1.3883 1.2944 1.3269 1.3127 1.4174 1.3679 1.3678 1.2928 1.2893 2.6105 1.0830 1.0804 1.0803 1.0545 1.0971 1.0810 1.0517 1.0579 1.0446 1.0879 1.0825 10.0510 1.0707 1.0712 1.0694 1.0357 1.0690 1.0676 1.0626 1.0355 1.0849 1.0581 1.0895 1.1001 1.0885 1.1065 1.1013 1.0991 1.0985 1.0953 1.1026 1.0930
irintensity: 0.1066 0.0305 0.2967 0.0111 1.8001 3.3133 3.4958 1.5491 1.6786 5.1013 0.9374 0.9107 0.7763 4.8866 10.1638 4.3205 8.3640 1.0628 2.3814 0.4185 4.2862 7.0398 0.9767 17.4275 5.8106 4.5638 24.7983 3.0501 1.9187 9.0113 3.3934 7.7278 9.5289 11.7089 97.4292 48.5670 11.8685 8.6234 129.5811 63.7794 21.7353 2.8795 26.8406 3.5781 51.3405 17.7956 12.6474 193.0676 142.3077 0.0482 19.8660 36.0118 13.5957 14.9244 13.2899 10.5062 17.0003 7.5842 1.3671 7.7069 2.5208 51.4146 11.5240 126.5770 1.1617 21.1471 19.0215 3.9971 7.7289 1.3403 6.4345 4.9332 10.9704 15.5281 9.4961 442.3686 52.5465 56.4906 163.4568 43.3384 28.5627 66.3473 16.3699 22.3758 27.1697 28.0286 45.3815 14.9439 35.7562 8.7678 84.7251 48.9190 35.7441 6.1219 50.4196 5.3784
temp: 298.150 k
press: 1.00000 atm
elementType: 8 8 7 7 6 6 6 6 6 6 6 6 6 6 1 1 1 1 1 1 1 1 1 1 1 1 1 1 1 1 1 1 1 1
symmnumber: 1
zpe: 778190.8 jmol-1
zpe.correction: 0.296397 hartree
zpe.thermalcorrener: 0.312282 hartree
zpe.thermalcorrenthalpy: 0.313226 hartree
zpe.thermalcorrgfe: 0.251929 hartree
zpe.sumelectzpe: -651.869177 hartree
zpe.sumelectthermal: -651.853293 hartree
zpe.sumelectthermalent: -651.852348 hartree
zpe.sumelectthermalfe: -651.913646 hartree
dipole: 1.7050 -2.1940 -0.1699
dipole: 2.7838
quadrupole: -80.7441 -88.0611 -86.5623
quadrupole: 9.2945 -1.5455 1.1233
quadrupole: 4.3784 -2.9386 -1.4398 9.2945 -1.5455 1.1233
hfenergy: -652.1655744 hartree
pointgroup: C01 [X(C10H20N2O2)]
dipole: -0.6715106 -0.8613103 0.0822279 debye
polarizability: 172.0909013|-0.2538437|122.72716|3.5029666|1.9999806|98.4370955 unknown
InChI: InChI=1S/C10H20N2O2/c1-3-5-11-6-8-12(9-7-11)10(13)14-4-2/h3-9H2,1-2H3
charge 0 multiplicity 1
34 atoms
O  2.82855 -0.591822 -0.062958
O  2.741251 1.737008 0.261397
N  -2.009395 0.267859 -0.158417
N  0.840475 0.525957 -0.401067
C  -1.127253 -0.914015 0.015319
C  -1.316563 1.496134 0.312683
C  0.182173 -0.739046 -0.779603
C  -0.017893 1.722946 -0.482859
C  -3.342283 0.100629 0.475363
C  -4.239326 -0.93254 -0.238464
C  2.166116 0.655524 -0.046769
C  -5.657003 -0.97949 0.371952
C  4.267066 -0.533922 0.31648
C  4.802822 -1.958875 0.209831
H  -1.645344 -1.814427 -0.357793
H  -0.880262 -1.081102 1.09626
H  -1.069392 1.439293 1.40406
H  -1.988246 2.361178 0.160287
H  0.870948 -1.573642 -0.585891
H  -0.058582 -0.714773 -1.86214
H  -0.273221 1.91929 -1.543843
H  0.547907 2.580884 -0.085797
H  -3.252351 -0.174668 1.559731
H  -3.849549 1.084978 0.439051
H  -4.2903 -0.666651 -1.311338
H  -3.788057 -1.942099 -0.179692
H  -5.622492 -1.247804 1.444986
H  -6.161146 0.001683 0.286617
H  -6.287433 -1.727482 -0.14182
H  4.785768 0.163241 -0.366174
H  4.3469 -0.129599 1.342009
H  5.874038 -1.9766 0.48217
H  4.260236 -2.636984 0.89102
H  4.699742 -2.342464 -0.819892
