program: Gaussian 09
title: 000116062
version: EM64L-G09RevD.01
frameworkgroup: C1[X(C9H13O3PS)]
method: RPBEPBE
basis: SDD
operation: Freq
keyword: #p
keyword: freq=noraman
keyword: PBEPBE/SDD
title: #p freq=noraman PBEPBE/SDD
converged: YES YES NO NO
title: Mulliken charges:
elementType: S P O O O C C C C C C C C C H H H H H H H H H H H H H
charge: -0.000130 1.089447 -0.487747 -0.684830 -0.583461 -0.218305 0.449074 -0.153892 -0.222801 -0.355058 -0.387669 -0.211534 -0.801515 -0.654515 0.264241 0.248826 0.236167 0.235239 0.242902 0.220041 0.225036 0.229746 0.240508 0.208597 0.234347 0.237491 0.399795
chargesum: 0.00000
title: Mulliken charges with hydrogens summed into heavy atoms:
elementType: S P O O O C C C C C C C C C
charge: -0.000130 1.089447 -0.487747 -0.285035 -0.583461 -0.218305 0.449074 0.110349 0.026026 -0.118891 -0.152429 0.251409 -0.106225 0.025919
polarizability: 2.17738907e+02 9.58046749e+00 1.41780234e+02 -1.10577548e+01 1.24062888e+01 1.16717526e+02
1716.lowfreq: -21.6125 -11.2372 -7.6238 -0.0012 0.0009 0.0016 2.1290 15.9536 22.3524
frequency: -19.3574 15.4401 22.3296 46.6621 51.8488 77.4620 108.9240 124.3271 140.7854 171.8651 201.9449 223.7136 247.6988 266.5489 282.2909 314.3619 327.7422 358.8428 375.9734 395.6053 407.6126 429.2393 495.0595 606.2235 629.1065 649.4057 689.8268 706.9253 786.8982 810.2211 819.1741 841.2759 872.6927 952.6202 972.7947 979.7052 986.5453 1001.2609 1015.7077 1047.4299 1053.8615 1069.0365 1105.8989 1119.4124 1132.8535 1192.1070 1221.3851 1250.0109 1297.5606 1352.8329 1363.2446 1395.6366 1395.8129 1397.6515 1456.9088 1468.8620 1473.7526 1477.3556 1479.3049 1489.6315 1574.4564 1602.5379 2978.1825 2990.3024 2996.5611 3058.6944 3064.1333 3088.5874 3092.6865 3113.0567 3128.2527 3130.6243 3156.6899 3169.9122 3600.7381
redmass: 1.0365 4.3162 3.6580 2.8170 5.9195 2.5212 3.2896 4.9110 2.2272 5.5779 3.2423 3.1225 1.4435 5.8200 3.0518 4.6735 6.8719 3.1213 6.6366 5.6296 2.9643 10.5942 2.7500 5.7237 6.9652 8.8288 7.3757 3.2687 5.0127 1.0889 1.3760 1.2497 3.9656 1.3121 1.3904 1.3087 1.4340 4.0946 2.5599 1.5848 6.9232 2.8890 2.2697 1.3241 1.4128 1.1116 3.0280 1.1469 1.2774 1.2559 4.6607 1.3278 2.7125 1.2558 1.0397 1.0804 1.0789 2.3400 1.0522 1.0823 6.1416 6.1192 1.0383 1.0551 1.0401 1.0957 1.1054 1.0994 1.0977 1.1023 1.0887 1.0896 1.0962 1.0958 1.0665
irintensity: 0.8209 1.3144 0.1735 0.8040 3.5481 2.0233 16.7660 1.1039 55.5984 3.6710 31.1335 3.6290 4.9035 5.7215 23.9841 8.0376 12.1273 2.2684 4.3803 21.3617 2.7992 128.0444 21.1180 1.3699 0.4676 221.5636 152.4894 0.5336 0.9237 3.3737 51.4636 1.2909 121.9807 0.6541 0.9348 36.7307 1.4035 9.4597 132.8816 14.1823 110.6397 0.3968 18.8817 8.3806 7.7675 5.5455 3.3397 0.5908 1.2792 5.6067 0.5960 17.5955 13.3303 12.8371 11.6896 13.9722 13.9461 30.7811 6.2136 11.6045 0.1639 11.9594 30.6739 18.5563 24.6875 21.2110 9.8716 18.0143 26.1123 31.3400 12.3929 17.5756 10.9250 1.2277 98.8810
temp: 298.150 k
press: 1.00000 atm
elementType: 16 15 8 8 8 6 6 6 6 6 6 6 6 6 1 1 1 1 1 1 1 1 1 1 1 1 1
symmnumber: 1
zpe: 534686.6 jmol-1
zpe.correction: 0.203651 hartree
zpe.thermalcorrener: 0.220041 hartree
zpe.thermalcorrenthalpy: 0.220985 hartree
zpe.thermalcorrgfe: 0.156783 hartree
zpe.sumelectzpe: -1314.639590 hartree
zpe.sumelectthermal: -1314.623200 hartree
zpe.sumelectthermalent: -1314.622256 hartree
zpe.sumelectthermalfe: -1314.686458 hartree
dipole: 0.9354 1.7710 1.8155
dipole: 2.7032
quadrupole: -80.6948 -87.3500 -107.1837
quadrupole: 1.3415 -7.1161 -0.1082
quadrupole: 11.0480 4.3928 -15.4408 1.3415 -7.1161 -0.1082
hfenergy: -1314.8432412 hartree
pointgroup: C01 [X(C9H13O3P1S1)]
dipole: -0.3793412 -0.6365951 0.7628535 debye
polarizability: 218.6906329|7.1185707|139.4788788|8.2636988|-14.3713001|118.0671554 unknown
InChI: InChI=1S/C7H7S.C2H6O3P/c1-6-2-4-7(8)5-3-6;1-2-5-6(3)4/h2-5H,1H3;3H,2H2,1H3
charge 0 multiplicity 1
27 atoms
S  0.831116 0.767462 1.487501
P  2.09708 0.784924 -0.471931
O  2.541411 -0.830801 -0.84641
O  3.602966 1.367709 0.177026
O  1.493579 1.579353 -1.704832
C  -0.819063 0.361005 0.774536
C  -3.429164 -0.244962 -0.180074
C  -1.485782 1.273223 -0.077336
C  -1.443972 -0.85021 1.151174
C  -2.776495 0.960888 -0.551669
C  -2.744795 -1.139547 0.682274
C  3.226995 -1.672912 0.182981
C  -4.811559 -0.574411 -0.713488
C  3.398474 -3.047079 -0.455317
H  -0.99563 2.20467 -0.37518
H  -0.920544 -1.554624 1.80581
H  -3.285342 1.666019 -1.219661
H  -3.22849 -2.075675 0.985266
H  4.193974 -1.200678 0.432187
H  2.593635 -1.71067 1.090795
H  -5.295502 -1.372521 -0.124794
H  -5.472407 0.310934 -0.699108
H  -4.756996 -0.921916 -1.763335
H  3.907365 -3.725597 0.254511
H  2.419715 -3.481715 -0.719105
H  4.008937 -2.976902 -1.371028
H  3.721695 2.350632 0.141708
