program: Gaussian 09
title: 000116041
version: EM64L-G09RevD.01
frameworkgroup: C1[X(C16H19N3)]
method: RPBEPBE
basis: SDD
operation: Freq
keyword: #pfreq=noraman
keyword: PBEPBE/SDD
title: #p freq=noraman PBEPBE/SDD
converged: YES YES NO NO
title: Mulliken charges:
elementType: N N N C C C C C C C C C C C C C C C C H H H H H H H H H H H H H H H H H H H
charge: -0.091181 -0.162979 -0.024309 -0.368813 -0.357687 -0.388815 -0.378221 -0.488929 0.495168 0.446456 -0.315102 -0.317229 -0.375259 -0.448297 -0.355876 -0.352753 -0.227852 -0.219994 -0.244178 0.234994 0.194303 0.186653 0.212222 0.209708 0.224942 0.222629 0.204251 0.223670 0.196172 0.215369 0.210947 0.262794 0.233278 0.231213 0.231390 0.226207 0.226147 0.228958
chargesum: 0.00000
title: Mulliken charges with hydrogens summed into heavy atoms:
elementType: N N N C C C C C C C C C C C C C C C C
charge: -0.091181 -0.162979 -0.024309 0.060484 0.041188 0.045835 0.048659 -0.069087 0.495168 0.446456 -0.099733 -0.106282 -0.112464 -0.215020 -0.124663 -0.121363 -0.001645 0.006153 -0.015220
polarizability: 2.70634807e+02 -1.21318270e+01 1.67696034e+02 -9.65964883e+00 -1.91916676e+00 1.34575303e+02
1716.lowfreq: -10.5207 -0.0007 -0.0005 -0.0004 4.7186 9.6000 15.9019 22.7630 34.4626
frequency: 14.2290 21.8373 34.2409 54.9509 65.4390 136.6087 147.9998 194.9883 203.7309 228.2640 260.0403 288.5040 311.9085 366.0241 380.1282 394.4716 406.0821 437.4842 459.7519 474.9709 525.4536 533.0730 599.3432 615.9340 623.7924 660.3216 705.1641 718.7710 730.2368 742.0755 789.8940 802.8316 810.1448 824.4238 842.9097 859.3826 914.9089 922.1099 939.5586 947.1554 958.0878 960.3229 982.4944 989.8348 997.1891 1000.6841 1010.6154 1026.5079 1048.1158 1054.2280 1073.8229 1079.7746 1094.5307 1101.2177 1136.5727 1152.6319 1170.5474 1176.6886 1180.7325 1207.0672 1213.7645 1234.9505 1239.1826 1254.1430 1280.5826 1303.6827 1309.2508 1317.9126 1337.7079 1344.4486 1355.9443 1365.6900 1370.5304 1381.1075 1384.6345 1398.9193 1421.8050 1441.1181 1455.2513 1455.7620 1460.6652 1464.9003 1474.5026 1483.8578 1486.4629 1530.9849 1594.1828 1595.1096 1615.0044 2848.9976 2852.0768 2865.5858 2936.7222 2940.8226 2989.2652 3032.8438 3051.9641 3077.7115 3088.4886 3113.5660 3121.2082 3123.8448 3124.4051 3136.7682 3147.7244 3162.5942 3171.4197 3175.9774
redmass: 3.8187 4.3886 4.0707 3.4397 4.1299 4.6586 4.0293 3.7223 3.9369 2.1128 3.5677 2.8836 2.5143 4.1910 2.5889 2.0150 2.8438 3.8739 2.9925 2.9439 3.1279 4.0155 4.9579 4.8737 2.6689 6.8606 2.1533 3.8853 2.9353 1.5953 3.1358 1.8262 3.7899 1.2803 1.5777 1.2480 1.4710 3.1934 1.3716 1.9785 4.9201 1.6222 1.3900 5.7550 1.3898 2.5699 1.8263 2.0989 1.8576 1.7744 2.1399 2.0995 2.0839 1.7639 2.5715 3.0697 1.0639 2.0628 1.1251 1.3039 2.0132 1.3721 1.3207 1.3826 1.3680 1.3784 2.4262 1.6643 1.4004 1.4032 1.2999 1.4589 1.4463 3.3779 2.3095 1.7024 2.5776 2.0704 1.0917 1.0824 1.1109 1.1178 1.1672 2.0448 2.2779 6.3952 5.6345 6.1014 6.1655 1.0707 1.0717 1.0693 1.0694 1.0699 1.0870 1.0891 1.0891 1.0908 1.0902 1.0873 1.0880 1.0861 1.0912 1.0913 1.0957 1.1014 1.0924 1.0937
irintensity: 0.4633 0.7170 0.1080 0.1311 0.2450 2.5149 3.7493 3.2867 0.4867 0.3080 1.2222 18.5109 1.7105 1.6943 0.1769 2.8715 0.3948 1.3099 9.7227 2.9202 14.6675 7.3646 2.5457 0.4770 0.6935 0.5986 35.5066 9.7160 1.0257 63.9339 18.1503 69.9455 5.9834 0.2158 0.4987 0.2732 0.3110 61.8381 0.2667 3.3653 36.1726 5.8806 0.6569 0.0074 3.0225 58.7433 5.0575 7.7164 3.4649 0.5593 9.4101 1.5336 2.0780 0.4945 62.5037 19.4982 0.7223 7.5037 2.9309 5.1485 7.4975 24.4465 26.7321 116.5132 18.4801 21.6961 0.2093 30.3616 14.7268 13.5463 2.1701 1.2053 0.9993 11.1052 51.1461 0.9248 2.6599 15.0474 4.4882 1.3547 65.6057 19.4084 13.2999 9.3216 77.8275 29.6596 359.3383 33.3395 4.4124 28.8151 40.3393 179.4585 28.0825 94.3952 20.1072 44.9966 23.3093 20.3085 22.0988 8.8870 32.6625 0.0617 21.2919 16.5660 34.1225 26.0389 32.5565 7.8312
temp: 298.150 k
press: 1.00000 atm
elementType: 7 7 7 6 6 6 6 6 6 6 6 6 6 6 6 6 6 6 6 1 1 1 1 1 1 1 1 1 1 1 1 1 1 1 1 1 1 1
symmnumber: 1
zpe: 836936.5 jmol-1
zpe.correction: 0.318772 hartree
zpe.thermalcorrener: 0.335101 hartree
zpe.thermalcorrenthalpy: 0.336045 hartree
zpe.thermalcorrgfe: 0.271929 hartree
zpe.sumelectzpe: -783.944813 hartree
zpe.sumelectthermal: -783.928485 hartree
zpe.sumelectthermalent: -783.927541 hartree
zpe.sumelectthermalfe: -783.991657 hartree
dipole: 5.1613 1.5423 -0.2597
dipole: 5.3931
quadrupole: -147.4996 -103.6292 -111.9319
quadrupole: -10.3937 -4.4410 0.5492
quadrupole: -26.4794 17.3910 9.0883 -10.3937 -4.4410 0.5492
hfenergy: -784.2635857 hartree
pointgroup: C01 [X(C16H19N3)]
dipole: -2.0268316 -0.5223781 -0.3479529 debye
polarizability: 269.3316594|-16.5119041|164.8678141|11.89242|9.3646344|138.7066702 unknown
InChI: InChI=1S/C16H19N3/c1-2-4-15(5-3-1)14-18-10-12-19(13-11-18)16-6-8-17-9-7-16/h1-9H,10-14H2
charge 0 multiplicity 1
38 atoms
N  -1.028636 -0.926724 -0.244826
N  1.791399 -0.294063 0.005209
N  5.970198 0.666613 0.46555
C  -0.504492 0.374122 -0.71709
C  -0.004201 -1.971352 -0.459053
C  0.762446 0.769277 0.058999
C  1.273223 -1.642585 0.332069
C  -2.340705 -1.272787 -0.844558
C  3.147797 0.01708 0.18691
C  -3.469732 -0.367376 -0.361133
C  3.620633 1.368007 0.258161
C  4.160599 -0.991651 0.288401
C  -3.554694 0.007099 1.004203
C  -4.472637 0.07758 -1.256707
C  4.998659 1.626327 0.386278
C  5.512286 -0.622422 0.416372
C  -4.624234 0.806053 1.463861
C  -5.547689 0.874531 -0.798535
C  -5.627093 1.240813 0.564385
H  -1.273356 1.150827 -0.560258
H  -0.26793 0.338149 -1.811574
H  0.255328 -2.077602 -1.543768
H  -0.398029 -2.942514 -0.105456
H  1.161802 1.689047 -0.397263
H  0.490372 0.994062 1.113988
H  1.051184 -1.711424 1.419947
H  2.030888 -2.403215 0.089376
H  -2.561284 -2.319498 -0.552008
H  -2.307007 -1.255667 -1.963886
H  2.939207 2.221132 0.228105
H  3.921611 -2.057335 0.262435
H  -2.765834 -0.325931 1.687884
H  -4.412495 -0.19816 -2.317347
H  5.35115 2.663712 0.437788
H  6.280885 -1.401719 0.486642
H  -4.678513 1.08929 2.521402
H  -6.316201 1.21206 -1.503206
H  -6.457606 1.860342 0.921204
