program: Gaussian 09
title: 000116020
version: EM64L-G09RevD.01
frameworkgroup: C1[X(C12H10Cl2N2S)]
method: RPBEPBE
basis: SDD
operation: Freq
keyword: #p
keyword: freq=noraman
keyword: PBEPBE/SDD
title: #p freq=noraman PBEPBE/SDD
converged: YES YES NO NO
title: Mulliken charges:
elementType: Cl Cl S N N C C C C C C C C C C C C H H H H H H H H H H
charge: -0.074298 -0.074337 0.152324 -0.688788 -0.688760 -0.319431 -0.319557 0.504214 0.504104 -0.174902 -0.174497 -0.375940 -0.375896 -0.120124 -0.120284 -0.200141 -0.200261 0.263496 0.263524 0.225841 0.225826 0.251883 0.251878 0.308333 0.323741 0.323727 0.308327
chargesum: 0.00000
title: Mulliken charges with hydrogens summed into heavy atoms:
elementType: Cl Cl S N N C C C C C C C C C C C C
charge: -0.074298 -0.074337 0.152324 -0.056714 -0.056705 -0.319431 -0.319557 0.504214 0.504104 0.088593 0.089026 -0.150099 -0.150071 -0.120124 -0.120284 0.051741 0.051617
polarizability: 2.03236915e+02 -2.47576264e+00 2.03576790e+02 -1.70436649e-02 -5.58620645e-02 1.41116388e+02
1716.lowfreq: -4.6447 -2.0498 0.0017 0.0022 0.0025 4.4000 14.3860 16.6369 37.1517
frequency: 13.3604 16.5045 37.1455 116.2953 116.6967 142.8677 144.5651 193.6211 200.6189 248.8126 298.4816 313.9588 322.5032 356.8711 358.6883 377.9039 380.8798 383.8553 385.9308 432.8698 456.9646 468.2161 469.7889 510.6214 510.9941 538.1644 556.4077 628.9330 629.2643 685.0825 692.0933 707.7755 721.5616 807.7791 808.0090 828.5708 830.3583 874.7428 876.2784 937.1669 937.4879 1005.3106 1009.3962 1028.9576 1045.2130 1083.1673 1086.6185 1151.7629 1152.4913 1254.5237 1255.0182 1311.0224 1314.7181 1370.9265 1370.9665 1398.9414 1399.7197 1474.0941 1479.0398 1565.2564 1567.8104 1596.9136 1598.1713 1622.6161 1631.0220 3133.1686 3133.2245 3167.1034 3167.2346 3171.5886 3171.6211 3532.2943 3533.0227 3690.4237 3690.6470
redmass: 7.3593 11.2403 6.7668 5.6341 5.6483 5.7536 8.9604 5.2527 13.2458 5.6682 5.5029 4.7800 4.6983 12.6757 12.2920 3.1600 6.8766 1.2165 1.4763 3.2297 3.0171 3.7918 3.2956 1.1171 1.1111 3.2587 4.0222 7.5963 7.6043 7.8981 7.1418 3.5428 3.7136 1.5723 1.5902 5.7692 5.7994 1.3823 1.3957 1.3409 1.3424 2.9865 2.3235 1.8074 2.0021 2.4370 2.5774 1.1790 1.1777 1.3981 1.4164 2.2588 2.2314 5.4631 5.4310 4.7741 4.9897 3.1683 3.2345 7.5650 7.6822 2.4426 2.2411 1.8258 1.6961 1.0893 1.0893 1.0929 1.0929 1.0957 1.0957 1.0467 1.0466 1.1021 1.1022
irintensity: 0.3619 0.9246 0.5621 0.0133 0.1365 0.9023 0.0311 3.4078 4.3764 0.1528 14.6845 7.8461 8.1007 4.5902 7.9748 37.3255 4.8418 139.1967 138.3496 10.2136 0.4231 10.9156 31.6716 98.9695 98.3248 0.5475 0.5771 31.8649 9.8902 40.6286 17.3042 0.2000 1.0242 48.7665 56.9607 9.3785 2.8144 13.9595 13.6376 0.2194 0.1480 9.7952 2.3383 31.4011 1.1368 26.9400 7.4476 37.0648 0.0091 26.2967 2.4780 19.7779 6.2114 0.0219 31.0986 13.7353 8.5321 272.5528 111.5010 0.0719 0.0569 3.8151 18.2505 341.4429 139.6325 26.7740 2.1548 0.2652 0.9044 8.3621 3.1357 84.7293 47.5721 85.6719 3.9234
temp: 298.150 k
press: 1.00000 atm
elementType: 17 17 16 7 7 6 6 6 6 6 6 6 6 6 6 6 6 1 1 1 1 1 1 1 1 1 1
symmnumber: 1
zpe: 505318.7 jmol-1
zpe.correction: 0.192466 hartree
zpe.thermalcorrener: 0.208978 hartree
zpe.thermalcorrenthalpy: 0.209923 hartree
zpe.thermalcorrgfe: 0.145796 hartree
zpe.sumelectzpe: -1889.766970 hartree
zpe.sumelectthermal: -1889.750458 hartree
zpe.sumelectthermalent: -1889.749514 hartree
zpe.sumelectthermalfe: -1889.813640 hartree
dipole: -0.0045 0.0066 2.4729
dipole: 2.4729
quadrupole: -128.0398 -95.3927 -123.4505
quadrupole: -19.2593 0.0386 -0.0629
quadrupole: -12.4121 20.2349 -7.8228 -19.2593 0.0386 -0.0629
hfenergy: -1889.9594362 hartree
pointgroup: C01 [X(C12H10Cl2N2S1)]
dipole: -0.0014237 0.0001303 -0.972901 debye
polarizability: 204.7395409|2.0932424|202.0740578|0.0735231|0.0707894|141.1164934 unknown
InChI: InChI=1S/C12H10Cl2N2S/c13-7-1-3-9(15)11(5-7)17-12-6-8(14)2-4-10(12)16/h1-6H,15-16H2
charge 0 multiplicity 1
27 atoms
Cl 3.112483 -2.775756 1.771662
Cl -3.106955 2.776554 1.771111
S  0.000621 -0.002556 -2.002539
N  2.032943 2.241977 -1.443929
N  -2.037032 -2.242544 -1.445551
C  1.434921 -0.061788 -0.823986
C  -1.434169 0.059709 -0.824609
C  2.280759 1.086723 -0.712323
C  -2.282518 -1.087009 -0.713602
C  1.686157 -1.230986 -0.075692
C  -1.683149 1.229237 -0.07607
C  3.393235 1.007745 0.180104
C  -3.395242 -1.005842 0.178327
C  2.786596 -1.263132 0.798343
C  -2.783919 1.263517 0.797466
C  3.645883 -0.153904 0.932571
C  -3.645721 0.156154 0.930978
H  1.026014 -2.097347 -0.173356
H  -1.021043 2.094177 -0.173103
H  4.059159 1.872008 0.284917
H  -4.063081 -1.868695 0.282592
H  4.500544 -0.195251 1.61415
H  -4.500592 0.199181 1.612185
H  2.636928 3.053341 -1.357163
H  1.240738 2.270335 -2.083833
H  -1.244101 -2.272845 -2.084455
H  -2.642661 -3.052702 -1.358995
