program: Gaussian 09
title: 000116017
version: EM64L-G09RevD.01
frameworkgroup: C1[X(C15H12N2O4S)]
method: RPBEPBE
basis: SDD
operation: Freq
keyword: #p
keyword: freq=noraman
keyword: PBEPBE/SDD
title: #p freq=noraman PBEPBE/SDD
converged: NO YES NO NO
title: Mulliken charges:
elementType: S O O O O N N C C C C C C C C C C C C C C C H H H H H H H H H H H H
charge: 0.334498 -0.208400 -0.188132 -0.192727 -0.245384 0.008039 -0.393789 -0.425012 0.448427 0.349435 -0.453742 -0.487566 -0.082620 -0.392900 0.500072 -0.193802 0.128675 -0.354749 -0.246381 -0.211931 -0.784014 -0.066894 0.332699 0.275778 0.255944 0.262542 0.312850 0.240272 0.236858 0.314485 0.268942 0.239848 0.240626 0.178050
chargesum: 0.00000
title: Mulliken charges with hydrogens summed into heavy atoms:
elementType: S O O O O N N C C C C C C C C C C C C C C C
charge: 0.334498 -0.208400 -0.188132 -0.192727 -0.245384 0.008039 -0.079304 -0.425012 0.448427 0.349435 -0.453742 -0.154867 0.193158 -0.136955 0.500072 0.068740 0.128675 -0.041899 -0.006109 0.024927 -0.034598 0.111157
polarizability: 3.01420281e+02 -1.57258218e+01 2.10094864e+02 -1.84695875e+01 6.14678467e+00 1.73487022e+02
1716.lowfreq: -0.0003 0.0002 0.0013 2.6865 5.9300 8.1665 17.4809 24.1819 49.6875
frequency: 17.4580 24.0267 49.6817 52.2729 72.1753 76.4219 91.8950 130.9414 153.7207 154.8446 156.6468 164.1759 188.9282 231.4061 235.0082 272.8077 284.1368 311.8132 332.9267 357.6443 379.1818 423.0904 434.9580 443.9798 480.7065 488.9051 510.6158 517.9483 538.7199 557.5486 600.1560 615.3247 653.7985 659.8484 698.6509 722.3690 727.1571 735.4791 750.8386 765.7353 775.7972 835.1002 842.4477 848.5866 895.1367 954.5740 962.8712 966.3502 973.9085 992.2379 1006.8175 1007.7863 1024.0152 1031.2102 1039.4078 1082.7654 1095.5438 1105.6156 1132.1674 1170.2923 1175.0257 1198.3426 1232.0033 1241.0790 1278.2188 1296.2178 1352.8474 1357.4952 1362.8177 1374.8200 1386.0140 1413.8788 1424.2800 1445.1342 1446.9501 1462.2030 1463.0693 1504.8644 1546.6717 1580.5479 1589.3546 1598.2197 1616.5570 1635.7167 2948.5062 2984.7176 3067.9441 3127.4475 3139.8122 3149.9329 3150.5863 3166.5106 3169.3353 3170.7682 3189.3240 3434.0713
redmass: 8.3174 7.5059 5.7397 5.2962 5.8157 9.2223 6.1134 4.4972 3.3161 2.7748 7.3947 1.4898 8.4277 4.2210 9.7609 7.2396 4.5408 8.3792 7.4733 3.8764 6.7448 8.7968 3.6458 5.1947 4.2899 3.9095 6.6220 6.6208 4.2413 3.9395 3.3156 5.0371 6.8416 7.7789 4.4595 1.6528 4.8704 5.2717 2.5029 5.9200 1.2845 6.1979 7.2923 1.3580 1.3576 1.5845 1.9803 1.3752 1.4029 1.3609 1.4503 4.8596 5.6430 1.8493 2.4464 1.7076 4.8781 2.5387 1.7059 1.5169 1.0728 9.4136 1.6932 1.5807 2.2844 1.8067 3.6121 4.1623 7.1078 1.3705 1.3468 5.9182 2.4249 2.2617 1.1262 1.7585 1.3181 2.3471 7.0271 5.1964 7.1563 6.3769 7.5764 4.8144 1.0871 1.0379 1.0968 1.0990 1.0864 1.0889 1.0905 1.0917 1.0953 1.0984 1.0961 1.0770
irintensity: 0.9310 2.8634 3.4966 1.4799 0.9414 0.8278 3.2871 0.1694 6.4894 5.1890 3.5549 2.0189 11.0472 13.5573 1.1174 0.0886 5.2326 5.5049 2.0738 3.0582 3.5053 10.1209 0.5887 5.1149 6.2019 4.5569 15.1301 8.0982 22.3066 4.2146 11.4571 3.3423 4.3132 11.3405 0.1814 31.9004 21.9769 4.0924 10.8168 7.2223 106.4576 7.4762 4.1645 20.9040 4.1477 0.2212 34.6668 6.6042 16.2772 4.2482 10.6718 26.5389 28.9251 0.0266 1.4782 6.0109 16.5597 29.5330 13.8716 6.2965 1.9078 291.2467 105.0917 6.3374 144.1926 34.1043 78.2798 68.2122 93.9957 61.4064 42.0687 10.2519 104.7240 33.6165 35.9702 37.2320 17.7680 337.9579 33.1110 66.8761 231.7851 69.3556 45.1530 189.8540 85.9923 2.7814 10.2159 15.1593 2.0910 0.9514 10.5662 18.2208 2.6556 16.2949 7.8093 87.4410
temp: 298.150 k
press: 1.00000 atm
elementType: 16 8 8 8 8 7 7 6 6 6 6 6 6 6 6 6 6 6 6 6 6 6 1 1 1 1 1 1 1 1 1 1 1 1
symmnumber: 1
zpe: 636938.8 jmol-1
zpe.correction: 0.242597 hartree
zpe.thermalcorrener: 0.262693 hartree
zpe.thermalcorrenthalpy: 0.263638 hartree
zpe.thermalcorrgfe: 0.191511 hartree
zpe.sumelectzpe: -1385.624423 hartree
zpe.sumelectthermal: -1385.604327 hartree
zpe.sumelectthermalent: -1385.603383 hartree
zpe.sumelectthermalfe: -1385.675509 hartree
dipole: 2.5201 -4.4742 -2.7816
dipole: 5.8401
quadrupole: -164.5016 -141.2395 -128.9900
quadrupole: 14.6067 -8.8992 8.5912
quadrupole: -19.5912 3.6709 15.9204 14.6067 -8.8992 8.5912
hfenergy: -1385.8670206 hartree
pointgroup: C01 [X(C15H12N2O4S1)]
dipole: 0.7552407 1.4305253 1.6317201 debye
polarizability: 291.6394003|7.503036|204.8097997|40.0809879|15.2615075|188.5529676 unknown
InChI: InChI=1S/C15H12N2O4S/c1-10(19)11-6-7-15(13(8-11)17(20)21)22-14-5-3-2-4-12(14)16-9-18/h2-9,16H,1H3
charge 0 multiplicity 1
34 atoms
S  0.825936 -1.850743 0.016879
O  -5.195338 1.448764 -0.929031
O  -3.180052 -2.847481 -1.772181
O  -1.01062 -3.309649 -1.244736
O  4.347718 1.80602 -1.908784
N  -2.038839 -2.517243 -1.273948
N  2.796881 0.136069 -1.265314
C  -0.645464 -0.741765 -0.105741
C  -1.874738 -1.161527 -0.703519
C  -2.925809 1.007806 -0.265426
C  2.028995 -0.732247 0.891767
C  -2.990188 -0.304361 -0.780405
C  -0.600563 0.578415 0.411488
C  -1.710528 1.435562 0.334979
C  2.913844 0.108948 0.147635
C  2.133348 -0.818914 2.29589
C  -4.144792 1.887345 -0.379303
C  3.878792 0.884121 0.849709
C  3.096944 -0.051304 2.98739
C  3.958135 0.798012 2.254972
C  -4.081875 3.299395 0.187545
C  3.485134 0.928926 -2.180465
H  -3.914819 -0.660267 -1.245929
H  0.31905 0.930424 0.887055
H  -1.622922 2.444921 0.74965
H  1.457175 -1.487062 2.839087
H  4.543844 1.536754 0.280732
H  3.174663 -0.121284 4.07677
H  4.709028 1.398619 2.78001
H  2.123283 -0.536215 -1.655502
H  -5.052715 3.792532 0.029896
H  -3.855302 3.284583 1.270206
H  -3.290986 3.893082 -0.308427
H  3.167381 0.701063 -3.22285
