program: Gaussian 09
title: 000116016
version: EM64L-G09RevD.01
frameworkgroup: C1[X(C14H12N2O3S)]
method: RPBEPBE
basis: SDD
operation: Freq
keyword: #p
keyword: freq=noraman
keyword: PBEPBE/SDD
title: #p freq=noraman PBEPBE/SDD
converged: YES YES NO NO
title: Mulliken charges:
elementType: S O O O N N C C C C C C C C C C C C C C H H H H H H H H H H H H
charge: 0.338602 -0.212328 -0.196009 -0.194233 0.006818 -0.674957 -0.430291 0.448566 0.350607 -0.490803 -0.083264 -0.395366 -0.432800 0.519291 0.124828 -0.201661 -0.411307 -0.268150 -0.193723 -0.785495 0.331199 0.276841 0.252417 0.255777 0.223920 0.235020 0.227310 0.239452 0.238180 0.266897 0.324016 0.310647
chargesum: 0.00000
title: Mulliken charges with hydrogens summed into heavy atoms:
elementType: S O O O N N C C C C C C C C C C C C C C
charge: 0.338602 -0.212328 -0.196009 -0.194233 0.006818 -0.040295 -0.430291 0.448566 0.350607 -0.159604 0.193577 -0.142949 -0.432800 0.519291 0.124828 0.054116 -0.187387 -0.033130 0.033588 -0.040966
polarizability: 2.97091609e+02 1.64187655e+01 2.05822011e+02 8.93172363e+00 2.83728525e+00 1.36335734e+02
1716.lowfreq: -4.7064 -0.0015 -0.0008 0.0024 2.4398 4.4027 20.6306 31.1497 48.0742
frequency: 20.5226 31.1286 48.0725 53.4456 70.2175 87.1416 133.8861 144.8002 158.9355 162.9305 165.7575 247.0095 257.9115 277.9819 286.6925 319.4675 337.1068 385.1665 409.6181 433.8656 441.1159 450.1523 474.4849 488.7244 495.1847 511.4293 535.0712 546.4969 559.6121 599.3218 615.2374 656.0834 660.9315 698.0645 725.2883 734.5098 735.1676 759.0118 827.8059 842.5152 847.9280 853.1462 945.3301 961.1000 971.6911 976.9147 992.0186 998.9301 1015.7277 1029.2418 1037.1604 1042.1200 1081.8893 1095.3196 1138.0614 1168.6750 1172.7890 1200.3607 1231.0036 1268.0704 1278.5851 1324.6551 1352.3396 1363.2467 1372.7864 1382.7759 1415.5791 1441.6600 1446.1559 1461.0211 1462.3404 1483.0702 1543.8977 1569.4622 1587.9881 1607.3961 1615.6629 1633.8504 2983.9069 3067.5057 3122.5126 3127.4521 3140.4647 3147.3322 3147.9949 3165.3509 3170.3743 3172.6097 3533.7100 3684.5887
redmass: 7.1518 4.8927 5.2801 5.3626 6.6439 6.9793 5.0162 1.1452 3.6657 10.3238 5.0769 6.0820 5.2530 6.8475 4.6913 7.3382 8.6673 5.9135 1.1303 3.6197 4.2583 4.1484 3.4058 3.8051 1.2298 5.6088 4.3430 5.8385 4.3696 3.2980 5.0506 7.2150 7.2868 4.4733 6.4799 4.1883 4.0287 1.4014 5.1714 7.1676 1.4103 1.4356 1.3645 1.9817 1.4069 1.3231 1.3575 3.1794 3.8439 1.8571 2.6330 2.0036 1.7533 4.7965 1.3419 1.4678 1.0711 10.4049 1.6825 1.6292 2.3245 1.9067 3.3431 7.2237 1.4045 7.1636 6.1392 2.5617 1.1185 2.3877 1.1042 3.0283 7.1729 6.3238 6.9780 2.6778 7.4533 1.6185 1.0379 1.0969 1.0869 1.0989 1.0886 1.0891 1.0930 1.0953 1.0919 1.1000 1.0464 1.1024
irintensity: 1.4371 0.4678 3.7423 0.0550 0.2888 0.1196 1.6478 0.0218 2.6923 4.2102 1.3897 1.0989 9.5968 0.4897 3.4694 4.4340 1.9194 1.1654 109.1547 0.5445 5.7683 16.5667 16.0794 6.5899 104.9575 37.5086 9.7088 0.0574 6.5593 11.2259 3.1060 6.6435 9.0758 0.1852 10.9433 5.5992 5.0273 95.0567 9.5468 3.4500 14.5964 10.9002 1.9752 38.9717 18.9263 0.3797 1.9385 6.2206 59.6267 0.0629 4.8493 11.0636 3.1075 16.8709 12.5080 5.3939 6.9857 313.3781 95.5278 31.9094 144.1514 14.5528 62.0571 95.7580 62.7054 20.7034 7.1607 9.7362 42.9958 33.4810 21.3275 75.6985 36.8508 9.3491 287.8571 3.2665 54.5616 244.4098 2.9093 11.1811 8.6676 16.3300 3.5301 2.2082 24.1633 8.8919 12.9393 22.1976 59.0836 41.9215
temp: 298.150 k
press: 1.00000 atm
elementType: 16 8 8 8 7 7 6 6 6 6 6 6 6 6 6 6 6 6 6 6 1 1 1 1 1 1 1 1 1 1 1 1
symmnumber: 1
zpe: 611421.1 jmol-1
zpe.correction: 0.232878 hartree
zpe.thermalcorrener: 0.251439 hartree
zpe.thermalcorrenthalpy: 0.252383 hartree
zpe.thermalcorrgfe: 0.184264 hartree
zpe.sumelectzpe: -1272.430467 hartree
zpe.sumelectthermal: -1272.411906 hartree
zpe.sumelectthermalent: -1272.410962 hartree
zpe.sumelectthermalfe: -1272.479081 hartree
dipole: -5.2968 -6.6068 1.7542
dipole: 8.6478
quadrupole: -138.5543 -129.4740 -110.3739
quadrupole: -4.2709 -6.0096 1.4269
quadrupole: -12.4202 -3.3399 15.7601 -4.2709 -6.0096 1.4269
hfenergy: -1272.663345 hartree
pointgroup: C01 [X(C14H12N2O3S1)]
dipole: 1.9305604 2.8015251 -0.0045128 debye
polarizability: 290.0104166|18.2604645|204.9321515|-29.3305543|-17.5104454|144.3067858 unknown
InChI: InChI=1S/C14H12N2O3S/c1-9(17)10-6-7-14(12(8-10)16(18)19)20-13-5-3-2-4-11(13)15/h2-8H,15H2,1H3
charge 0 multiplicity 1
32 atoms
S  1.412584 -1.58596 -0.035499
O  -5.057132 0.826682 0.599304
O  -2.631429 -3.325692 0.937159
O  -0.383194 -3.46839 0.59394
N  -1.489938 -2.795255 0.656543
N  2.887737 0.283245 1.960354
C  -0.19198 -0.686859 0.081382
C  -1.425539 -1.34137 0.391881
C  -2.681187 0.755973 0.225518
C  -2.64289 -0.634555 0.461584
C  -0.250894 0.712302 -0.153392
C  -1.461184 1.418821 -0.083975
C  2.572368 -0.194967 -0.431486
C  3.205165 0.527132 0.63142
C  -4.005211 1.466827 0.310979
C  2.912011 0.054606 -1.77964
C  4.169272 1.521415 0.278669
C  3.866674 1.039598 -2.112465
C  4.487669 1.770198 -1.068609
C  -4.048542 2.96684 0.043708
H  -3.566361 -1.170905 0.70032
H  0.674068 1.241152 -0.400372
H  -1.451151 2.496819 -0.274362
H  2.420539 -0.530023 -2.564778
H  4.666911 2.087324 1.075493
H  4.124735 1.228617 -3.158585
H  5.234004 2.536229 -1.30816
H  -3.68371 3.201397 -0.973914
H  -3.410818 3.517955 0.76024
H  -5.086296 3.31812 0.143295
H  2.267578 -0.488516 2.200898
H  3.366642 0.77904 2.70655
