program: Gaussian 09
title: 000116012
version: EM64L-G09RevD.01
frameworkgroup: C1[X(C6H4N2O2)]
method: RPBEPBE
basis: SDD
operation: Freq
keyword: #pfreq=noraman
keyword: PBEPBE/SDD
title: #p freq=noraman PBEPBE/SDD
converged: YES YES NO NO
title: Mulliken charges:
elementType: O O N N C C C C C C H H H H
charge: -0.151222 -0.151222 0.046682 0.046682 -0.465417 -0.465420 0.211250 0.211251 -0.206623 -0.206625 0.282880 0.282452 0.282883 0.282448
chargesum: 0.00000
title: Mulliken charges with hydrogens summed into heavy atoms:
elementType: O O N N C C C C C C
charge: -0.151222 -0.151222 0.046682 0.046682 0.099915 0.099912 0.211250 0.211251 -0.206623 -0.206625
polarizability: 1.07172731e+02 1.67226505e+01 7.56875500e+01 -1.80354180e-03 -4.13371165e-03 4.16338639e+01
1716.lowfreq: -3.5767 -2.3401 -0.0013 -0.0011 -0.0010 2.9507 9.5399 49.3332 76.8948
frequency: -3.5419 49.3332 76.8948 102.4799 136.8247 224.8034 236.5158 263.7453 272.1262 402.6671 498.3020 546.9322 563.3776 594.8764 606.2770 756.3600 789.2758 881.1980 999.9383 1020.5306 1086.5077 1116.4428 1140.6094 1259.5268 1287.9641 1364.4100 1423.6600 1426.9785 1597.1728 1607.9106 2165.3570 2165.5764 2986.3249 2993.1578 3025.4515 3044.0466
redmass: 10.1598 4.8111 10.9460 2.0572 12.4724 8.2562 10.0058 6.3459 7.3578 12.8446 6.4047 1.8977 3.3120 9.5564 7.7911 9.5617 1.8400 4.5639 2.4982 7.9837 2.9177 2.6254 1.1987 1.1074 1.7647 1.7823 1.1340 1.1021 10.1127 8.6703 12.6863 12.6847 1.0635 1.0606 1.0966 1.0979
irintensity: 3.1201 14.0369 4.3247 0.0002 0.0000 27.4020 0.0004 0.0008 5.0786 0.0001 2.0255 0.3288 0.0005 0.0000 13.9294 27.0549 23.7254 0.0011 0.0008 0.0000 199.0760 0.0000 0.1439 0.0595 174.8239 0.0013 0.0010 95.8773 209.8724 0.0042 79.3110 0.0059 0.0000 29.2542 0.0015 2.3333
temp: 298.150 k
press: 1.00000 atm
elementType: 8 8 7 7 6 6 6 6 6 6 1 1 1 1
symmnumber: 1
zpe: 231558.5 jmol-1
zpe.correction: 0.088196 hartree
zpe.thermalcorrener: 0.097645 hartree
zpe.thermalcorrenthalpy: 0.098589 hartree
zpe.thermalcorrgfe: 0.052233 hartree
zpe.sumelectzpe: -490.206306 hartree
zpe.sumelectthermal: -490.196857 hartree
zpe.sumelectthermalent: -490.195913 hartree
zpe.sumelectthermalfe: -490.242269 hartree
dipole: 0.0000 0.0001 0.0196
dipole: 0.0196
quadrupole: -86.9834 -66.0239 -52.6204
quadrupole: 0.0376 -0.0002 0.0015
quadrupole: -18.4408 2.5187 15.9221 0.0376 -0.0002 0.0015
hfenergy: -490.2945021 hartree
pointgroup: C01 [X(C6H4N2O2)]
dipole: -0.0000165 0.0000341 0.0077054 debye
dipolederiv: -0.6146906 -0.0067048 0.0002335 0.0242193 -0.7076048 -0.0020667 0.0001701 -0.0018361 -0.2706571 -0.6146792 -0.0067029 -0.0002306 0.024227 -0.7076053 0.0021647 -0.000174 0.0019511 -0.2706607 -0.0147792 0.0693439 0.0002154 0.0674504 -0.1087622 0.0003024 0.0001252 0.0003082 -0.1891625 -0.014807 0.0693811 -0.0002143 0.0674564 -0.1087377 -0.0003123 -0.0001365 -0.0003239 -0.1891638 -0.285129 0.1286387 0.0008541 0.3376691 -0.2274914 -0.0013286 0.0005857 -0.0003407 0.0952654 -0.2851208 0.1286355 -0.0008896 0.3376376 -0.227496 0.0014112 -0.0006821 0.0004325 0.0952651 1.4527719 -0.0057293 -0.0010341 -0.0684822 1.0504616 0.0034115 -0.0014966 0.0031884 0.278988 1.4527358 -0.0057254 0.0010378 -0.0684658 1.0504655 -0.0035958 0.0015191 -0.0033816 0.2789891 -0.6539976 -0.2042818 -0.0004835 -0.1834004 -0.1947399 -0.0008727 -0.0001407 -0.0009457 0.0308825 -0.6539542 -0.204319 0.0005204 -0.1834131 -0.1947646 0.0009201 0.0001726 0.0009927 0.0308849 0.0588815 0.0096287 0.0237654 -0.0890743 0.0940361 0.0634587 0.0283458 0.0680849 0.027866 0.056943 0.0091028 -0.0240588 -0.0883764 0.094103 -0.0630331 -0.0283938 -0.0684455 0.0268187 0.0588816 0.0096166 -0.0237701 -0.0890881 0.0939948 -0.0634754 -0.0283151 -0.068107 0.0279131 0.0569438 0.009116 0.0240544 -0.0883595 0.0941409 0.0630161 0.0284202 0.0684229 0.0267714 unknown
polarizability: 107.2634498|16.6367819|75.5968311|-0.0018148|-0.0041288|41.6338639 unknown
InChI: InChI=1S/C6H4N2O2/c7-3-5(9)1-2-6(10)4-8/h1-2H2
charge 0 multiplicity 1
14 atoms
O  1.844542 -1.745368 -0.00098
O  -1.844581 1.745339 -0.001348
N  4.229155 0.788052 0.008634
N  -4.229131 -0.788194 0.008845
C  0.651799 0.405227 0.009775
C  -0.651835 -0.405253 0.009935
C  1.879471 -0.489309 0.004789
C  -1.879509 0.489282 0.004753
C  3.175468 0.224605 0.006868
C  -3.175506 -0.22463 0.006994
H  0.701183 1.085424 -0.864124
H  0.704751 1.08044 0.88731
H  -0.701267 -1.085729 -0.863742
H  -0.704741 -1.080186 0.88769
