program: Gaussian 09
title: 000116002
version: EM64L-G09RevD.01
frameworkgroup: C1[X(C9H15N5O)]
method: RPBEPBE
basis: SDD
operation: Freq
keyword: #p
keyword: freq=noraman
keyword: PBEPBE/SDD
title: #p freq=noraman PBEPBE/SDD
converged: YES YES NO NO
title: Mulliken charges:
elementType: O N N N N N C C C C C C C C C H H H H H H H H H H H H H H H
charge: -0.237445 -0.157974 -0.081646 -0.134151 -0.591262 -0.587288 0.047178 -0.442970 -0.449932 -0.397619 -0.395973 -0.387221 0.099532 0.079088 0.026046 0.231754 0.206228 0.232252 0.210231 0.214156 0.193957 0.202556 0.204667 0.193147 0.200137 0.191431 0.330165 0.332987 0.330712 0.337256
chargesum: 0.00000
title: Mulliken charges with hydrogens summed into heavy atoms:
elementType: O N N N N N C C C C C C C C C
charge: -0.237445 -0.157974 -0.081646 -0.134151 0.071890 0.080680 0.278933 -0.004490 -0.025545 -0.001106 0.001841 0.004347 0.099532 0.079088 0.026046
polarizability: 1.87452129e+02 -4.70907404e+00 1.40874662e+02 4.38130306e+00 -6.08721679e+00 8.84973552e+01
1716.lowfreq: -8.8891 -5.4768 -0.0006 -0.0004 -0.0002 11.4518 37.6535 43.7688 67.9407
frequency: 37.4458 43.6858 67.8032 152.7415 179.0348 188.0297 196.5836 214.9366 239.6505 293.7376 323.9154 329.0824 413.9859 436.0822 442.0284 468.2551 483.0887 489.8718 542.1127 548.3669 549.3789 582.6655 595.0595 676.0405 702.9118 709.3602 784.0448 789.4753 793.9121 841.4363 877.8174 892.7708 896.5653 900.9905 920.6831 947.3066 994.2311 1022.0149 1045.0829 1051.5690 1081.4595 1109.6208 1121.0342 1126.7198 1152.5061 1196.8509 1240.3179 1251.5412 1258.6150 1273.4913 1287.7495 1308.5842 1327.5195 1332.0417 1338.8976 1349.2779 1352.6840 1373.9212 1420.1894 1460.6335 1463.2377 1464.7450 1472.0229 1481.3467 1482.2274 1515.5468 1523.2666 1596.5236 1627.9080 2968.1042 2969.6797 2970.2071 2988.0273 2991.2742 3019.0080 3031.9235 3033.6726 3042.4229 3056.5957 3065.3090 3556.8261 3559.0624 3718.0781 3719.1168
redmass: 3.1976 5.0108 3.8966 3.5594 5.8228 7.8948 4.5782 1.8915 4.5287 2.8859 3.0600 2.2685 2.6743 3.2517 2.7429 1.1987 1.2250 1.7989 1.0531 1.1424 4.4520 5.5297 3.8065 6.3058 10.0191 11.4115 1.4445 2.4069 12.2088 2.2565 1.8425 2.4658 2.8489 3.3116 1.7540 2.3973 2.6828 3.6757 1.8468 1.0866 1.2813 2.6887 3.4186 2.4510 2.3454 1.4918 1.3180 1.2876 1.3884 5.0523 1.3255 1.3245 1.6887 1.3699 1.4680 1.5599 1.7117 2.5577 4.9901 1.0875 1.0919 1.0906 1.0884 1.1357 4.3352 2.1028 4.4160 1.4670 2.1297 1.0648 1.0661 1.0592 1.0618 1.0634 1.0840 1.0955 1.0975 1.1009 1.1019 1.1023 1.0440 1.0444 1.1059 1.1058
irintensity: 0.0452 1.7933 0.6004 2.1219 1.8055 0.2370 12.7685 0.3709 2.3912 1.2786 11.6835 0.8793 0.1744 3.0853 1.2768 41.3867 553.1454 1.3409 11.0569 0.7318 3.3461 1.3812 2.5601 5.5240 0.0583 0.0686 0.4249 0.9885 41.9830 11.5447 2.0486 9.5883 6.2450 10.0898 0.3200 74.1722 67.8079 28.4803 1.6168 0.2262 3.1927 6.3202 113.4347 1.3861 1.2209 1.0982 0.0857 4.8971 13.4561 7.0920 138.8953 0.4603 218.1011 2.5247 1.0543 11.1548 153.6955 144.4378 1.0888 1.6500 13.2068 5.5288 16.0430 53.7817 502.3127 118.6262 656.8960 671.1638 209.6545 31.5103 34.4440 40.0804 9.6092 19.1035 20.4458 60.5508 68.3186 50.8276 21.2951 68.1213 141.6787 58.4283 43.1635 52.1855
temp: 298.150 k
press: 1.00000 atm
elementType: 8 7 7 7 7 7 6 6 6 6 6 6 6 6 6 1 1 1 1 1 1 1 1 1 1 1 1 1 1 1
symmnumber: 1
zpe: 654019.6 jmol-1
zpe.correction: 0.249103 hartree
zpe.thermalcorrener: 0.262959 hartree
zpe.thermalcorrenthalpy: 0.263903 hartree
zpe.thermalcorrgfe: 0.208188 hartree
zpe.sumelectzpe: -699.833730 hartree
zpe.sumelectthermal: -699.819874 hartree
zpe.sumelectthermalent: -699.818930 hartree
zpe.sumelectthermalfe: -699.874645 hartree
dipole: 0.5066 2.4146 -0.2796
dipole: 2.4829
quadrupole: -70.5232 -80.4215 -90.2189
quadrupole: -1.3166 1.1921 -2.6408
quadrupole: 9.8646 -0.0336 -9.8310 -1.3166 1.1921 -2.6408
hfenergy: -700.0828333 hartree
pointgroup: C01 [X(C9H15N5O1)]
dipole: 0.1957653 0.9265413 -0.2396821 debye
polarizability: 187.421929|-3.687884|138.1419051|5.7276935|-13.061007|91.2603118 unknown
InChI: InChI=1S/C9H15N5O/c10-7-12-8(11)14-9(13-7)15-6-4-2-1-3-5-6/h6H,1-5,10-11H2
charge 0 multiplicity 1
30 atoms
O  -0.39226 -1.094255 0.074906
N  0.928606 0.80112 -0.422754
N  1.879977 -1.308071 0.332455
N  3.349595 0.586514 -0.171532
N  2.370494 2.582897 -0.905498
N  4.199889 -1.467716 0.569386
C  -1.60903 -0.281641 -0.268307
C  -2.054518 0.53166 0.959738
C  -2.668972 -1.299634 -0.709363
C  -3.401846 1.242348 0.67493
C  -4.01464 -0.587472 -0.996074
C  -4.488042 0.23426 0.227287
C  0.841418 -0.497499 -0.009878
C  2.216275 1.285547 -0.488229
C  3.111597 -0.705572 0.233738
H  -1.339034 0.402863 -1.094503
H  -2.169876 -0.160682 1.817146
H  -1.271984 1.266765 1.22055
H  -2.802258 -2.045908 0.09825
H  -2.312462 -1.845326 -1.602398
H  -3.257424 2.001308 -0.122181
H  -3.73059 1.789978 1.578728
H  -4.778267 -1.337538 -1.276581
H  -3.897498 0.089806 -1.867615
H  -5.429408 0.766595 -0.010142
H  -4.710676 -0.457489 1.065874
H  1.547054 3.125823 -1.150208
H  3.306492 2.974392 -0.966738
H  5.129805 -1.062255 0.509112
H  4.050884 -2.426916 0.871701
