program: Gaussian 09
title: 000014380
version: EM64L-G09RevD.01
frameworkgroup: C1[X(C14H20N2O2S)]
method: RPBEPBE
basis: SDD
operation: Freq
keyword: #p
keyword: freq=noraman
keyword: PBEPBE/SDD
title: #p freq=noraman PBEPBE/SDD
converged: YES YES NO NO
title: Mulliken charges:
elementType: S O O N N C C C C C C C C C C C C C C H H H H H H H H H H H H H H H H H H H H
charge: 0.979944 -0.540869 -0.541874 -0.306429 -0.689717 -0.072677 -0.081435 -0.433503 -0.466286 -0.415937 -0.450934 -0.413334 -0.406654 -0.111016 -0.205767 -0.205073 -0.405737 -0.407807 0.513924 0.211464 0.207671 0.238080 0.202617 0.209021 0.209486 0.219392 0.199715 0.208240 0.208026 0.195876 0.260419 0.257027 0.193623 0.275914 0.278516 0.229315 0.229488 0.313591 0.313699
chargesum: 0.00000
title: Mulliken charges with hydrogens summed into heavy atoms:
elementType: S O O N N C C C C C C C C C C C C C C
charge: 0.979944 -0.540869 -0.541874 -0.306429 -0.062427 0.138787 0.126236 0.007195 -0.047779 0.003170 -0.034669 0.042961 0.043995 -0.111016 0.070147 0.073443 -0.176422 -0.178319 0.513924
polarizability: 2.53579633e+02 2.56732737e+01 1.65335468e+02 1.30146614e+00 -7.82948330e-01 1.76756591e+02
1716.lowfreq: -20.8788 -5.7863 -5.1284 -0.0018 -0.0006 0.0010 11.6423 25.3233 40.6209
frequency: -8.0566 25.0417 40.4685 64.9267 78.7542 126.7821 128.0864 159.1860 197.8679 212.2831 225.2973 253.6694 277.0249 294.1578 305.6238 352.2102 358.9144 382.9777 401.5468 402.8106 410.2630 412.1118 416.8931 425.5471 443.2886 510.4973 515.6139 531.9032 596.5611 623.4081 713.0852 717.6828 740.6502 761.0646 782.7621 798.7286 811.8560 813.8115 817.5912 832.8043 841.3569 861.8887 887.7556 925.1232 938.2104 951.2714 962.6652 965.2388 970.0948 982.5031 989.1751 1007.9094 1020.8131 1049.3861 1082.1067 1092.4832 1096.0021 1120.3314 1128.6258 1152.1212 1161.4991 1181.5966 1197.5033 1204.8428 1228.8895 1240.8357 1266.5596 1296.7603 1298.5978 1301.9163 1311.1169 1318.5178 1318.6099 1325.2133 1333.4243 1343.5065 1347.9191 1358.9908 1362.1727 1396.4231 1430.4791 1456.7986 1464.7854 1471.2510 1474.3949 1478.9449 1487.5126 1491.8894 1583.7041 1613.4982 1647.6550 2887.3279 2891.5752 2965.5837 2973.4383 2974.7542 2989.1890 2990.0910 3005.5620 3017.2643 3040.8446 3043.6690 3047.9371 3051.6712 3068.8736 3130.1647 3132.1628 3157.4233 3160.5874 3563.1920 3702.2712
redmass: 3.4305 5.0147 3.7607 2.0408 4.7424 5.6031 5.6034 5.4780 4.5642 1.9701 8.6226 3.6251 4.7712 3.1694 5.0591 2.6077 4.1265 2.2194 2.3530 1.1905 3.3726 2.6269 1.4968 4.4242 6.8050 3.9714 3.2583 4.4610 7.1927 6.9209 3.2365 2.9505 4.3129 1.4258 2.5736 7.9833 6.3595 1.5732 1.2597 1.8850 3.7089 2.4660 2.6841 1.8287 5.3111 1.3468 1.4819 2.5007 2.1164 4.9019 2.5663 1.8641 1.4424 2.5314 1.6012 2.0822 1.9231 1.6212 1.1993 2.7294 1.1047 1.1178 1.2014 1.2430 1.3015 1.2219 1.2209 1.3131 1.3182 1.5646 1.5269 1.6499 2.5271 1.3570 1.3241 1.3748 1.4042 1.3211 1.3700 5.5703 3.6841 1.0761 1.0748 1.0860 1.0807 1.0914 2.8502 1.0929 7.3632 4.7648 1.2258 1.0692 1.0681 1.0665 1.0719 1.0660 1.0767 1.0653 1.0739 1.1006 1.0985 1.1007 1.0900 1.0927 1.1005 1.0889 1.0888 1.0951 1.0964 1.0452 1.1040
irintensity: 0.5132 1.4397 0.1935 0.4788 0.5794 2.2886 2.1789 0.6717 2.3104 0.0427 3.9624 0.5796 4.3382 0.9818 10.4354 0.5503 1.1644 3.5807 2.1315 0.4608 1.9448 0.0119 165.3046 136.5103 157.1186 5.3362 3.6487 82.2701 31.0416 0.5280 2.5476 1.4450 3.0657 1.3817 4.2485 44.0846 68.2628 14.5326 0.1839 50.9179 37.9792 10.1429 0.6336 3.1499 41.3531 1.6630 2.0267 14.2714 1.6235 3.9066 0.2973 5.8635 1.1224 48.8463 2.1828 0.6622 8.6605 0.0956 14.8899 3.9393 0.0245 43.2688 5.4655 2.7321 1.7919 1.6316 3.0776 3.1367 21.1896 12.5993 13.1842 8.4838 73.1176 0.5515 1.7600 6.2261 3.7812 4.5032 1.9618 5.7644 1.4411 2.4491 3.0584 17.2686 17.0583 49.1065 70.1231 1.2662 6.3206 155.2681 268.2932 29.0768 71.5363 1.7284 13.5433 2.3972 140.5238 75.1808 92.0515 10.6797 7.7035 44.0967 18.8182 26.8994 59.1622 12.6198 16.2571 2.3825 12.2701 108.0871 24.5983
temp: 298.150 k
press: 1.00000 atm
elementType: 16 8 8 7 7 6 6 6 6 6 6 6 6 6 6 6 6 6 6 1 1 1 1 1 1 1 1 1 1 1 1 1 1 1 1 1 1 1 1
symmnumber: 1
zpe: 844433.2 jmol-1
zpe.correction: 0.321628 hartree
zpe.thermalcorrener: 0.339139 hartree
zpe.thermalcorrenthalpy: 0.340084 hartree
zpe.thermalcorrgfe: 0.276237 hartree
zpe.sumelectzpe: -1201.880335 hartree
zpe.sumelectthermal: -1201.862823 hartree
zpe.sumelectthermalent: -1201.861879 hartree
zpe.sumelectthermalfe: -1201.925726 hartree
dipole: -3.5620 -8.0490 -0.0213
dipole: 8.8020
quadrupole: -86.2406 -136.6733 -116.5908
quadrupole: 13.0744 0.1540 -0.1691
quadrupole: 26.9276 -23.5050 -3.4226 13.0744 0.1540 -0.1691
hfenergy: -1202.2019624 hartree
pointgroup: C01 [X(C14H20N2O2S1)]
dipole: 1.4248918 -3.1215355 0.4666798 debye
polarizability: 253.8086965|-24.289595|165.1445704|7.0171665|1.5414051|176.7184253 unknown
InChI: InChI=1S/C14H20N2O2S/c15-13-5-7-14(8-6-13)19(17,18)16-9-11-1-2-12(10-16)4-3-11/h5-8,11-12H,1-4,9-10,15H2
charge 0 multiplicity 1
39 atoms
S  0.284244 1.714507 -0.257885
O  0.205607 2.680533 1.050737
O  0.272925 2.28809 -1.782752
N  -1.232053 0.614891 -0.139044
N  5.279899 -1.69299 0.353097
C  -2.871492 -0.764388 -1.413223
C  -2.777078 -0.639645 1.363894
C  -3.868106 0.266627 -0.819412
C  -3.079408 -2.14273 -0.738105
C  -3.8865 0.254423 0.748338
C  -2.872148 -2.08902 0.808506
C  -1.392909 -0.260672 -1.31994
C  -1.358829 -0.011906 1.193756
C  1.8245 0.654594 -0.069464
C  2.404117 0.087497 -1.220436
C  2.371014 0.47711 1.215817
C  3.559647 -0.700089 -1.077079
C  3.527151 -0.310264 1.355882
C  4.1360 -0.915213 0.213089
H  -3.086932 -0.880844 -2.494785
H  -2.937471 -0.694364 2.46039
H  -3.605126 1.275412 -1.181937
H  -4.879012 0.030321 -1.205699
H  -2.40323 -2.891851 -1.193627
H  -4.111125 -2.475399 -0.965656
H  -3.778197 1.286183 1.129061
H  -4.863635 -0.122566 1.10975
H  -1.959788 -2.645741 1.09885
H  -3.716607 -2.599866 1.310273
H  -0.702194 -1.137738 -1.303157
H  -1.154619 0.357025 -2.203751
H  -1.214718 0.792159 1.937247
H  -0.589992 -0.802358 1.370799
H  1.97516 0.288836 -2.207737
H  1.915388 0.975254 2.078105
H  4.029996 -1.142451 -1.962997
H  3.971972 -0.451928 2.347763
H  5.731319 -2.108594 -0.45666
H  5.707728 -1.833145 1.263892
