program: Gaussian 09
title: 000115992
version: EM64L-G09RevD.01
frameworkgroup: C1[X(C16H22N4O)]
method: RPBEPBE
basis: SDD
operation: Freq
keyword: #p
keyword: freq=noraman
keyword: PBEPBE/SDD
title: #p freq=noraman PBEPBE/SDD
converged: YES YES NO NO
title: Mulliken charges:
elementType: O N N N N C C C C C C C C C C C C C C C C H H H H H H H H H H H H H H H H H H H H H H
charge: -0.321950 -0.138756 -0.312788 -0.108957 -0.078876 -0.372957 -0.334824 -0.349727 -0.357419 0.222950 -0.154139 0.298987 -0.667642 -0.686832 0.416694 -0.770681 -0.329535 -0.360972 -0.219319 -0.207741 -0.239531 0.257056 0.208390 0.251588 0.195849 0.192893 0.205156 0.247284 0.188479 0.218319 0.208607 0.228648 0.227388 0.219083 0.200376 0.232011 0.319665 0.243903 0.249662 0.275994 0.233108 0.235249 0.235305
chargesum: 0.00000
title: Mulliken charges with hydrogens summed into heavy atoms:
elementType: O N N N N C C C C C C C C C C C C C C C C
charge: -0.321950 -0.138756 -0.312788 -0.108957 -0.078876 0.092490 0.112614 0.048321 0.078344 0.222950 -0.154139 0.298987 -0.012068 -0.039985 0.416694 0.024897 -0.079874 -0.084978 0.013789 0.027508 -0.004226
polarizability: 3.11696542e+02 -3.72461764e+00 2.03132749e+02 4.09186594e+00 -6.20743242e+00 1.25620646e+02
1716.lowfreq: -4.4762 0.0001 0.0005 0.0010 2.9215 8.0916 16.6962 34.0482 37.9095
frequency: 15.4363 33.9362 37.7476 48.4953 55.5047 66.7513 86.9389 94.7996 110.9408 131.6178 166.4534 184.6824 194.2048 222.6868 228.5824 240.6707 251.6221 263.5046 283.6540 294.2619 316.1540 353.2861 377.9636 393.2977 407.2722 419.8056 467.1775 495.9922 526.0638 563.1337 611.3201 645.8361 656.2796 660.2972 696.0348 697.1943 705.2201 732.5581 752.5502 763.1423 766.0723 842.8916 844.2983 865.6871 873.1489 896.0117 902.1964 923.6636 932.5946 961.3681 975.0192 989.4005 996.4949 1015.1109 1039.5938 1043.8772 1050.6309 1053.5891 1081.6231 1089.4814 1094.4334 1098.1782 1110.3518 1163.4693 1175.0975 1183.5275 1188.6501 1197.6852 1218.7643 1232.1760 1263.0955 1271.4691 1291.8071 1300.1790 1313.7354 1325.8500 1345.1643 1352.5827 1362.1563 1385.1621 1388.6131 1392.9369 1394.7650 1402.9188 1425.1807 1442.5228 1448.6609 1453.2199 1462.3752 1464.8735 1472.2112 1473.0418 1479.0581 1484.6319 1485.7576 1486.5677 1499.3670 1528.3949 1545.2769 1597.5778 1611.2983 2972.0801 2973.8646 2982.1123 2984.0887 2985.3429 2991.3064 2995.5963 3022.6254 3050.5949 3065.8719 3074.3129 3076.4421 3078.5117 3082.1434 3090.5429 3092.1832 3112.3786 3135.7025 3146.7737 3162.9970 3175.9477 3182.7743
redmass: 4.2267 4.4887 3.0218 3.6933 3.2787 3.3629 3.2044 4.6630 2.2808 2.7100 2.9166 1.0494 2.9905 1.4901 1.7780 2.1745 3.9306 3.4051 3.3204 2.2020 3.8634 3.5602 3.3693 5.1426 2.8616 2.5892 6.5467 3.8422 3.0651 3.9447 6.4208 6.1637 6.3800 6.7560 2.1058 5.4755 4.7606 1.1361 7.1419 1.4977 1.6995 1.2604 2.2538 1.6564 1.4025 1.7730 3.2801 1.6163 2.0841 4.0429 1.3823 6.1129 1.3226 3.0026 1.7840 2.3422 1.7793 1.8214 2.4441 1.5655 1.9718 2.0666 2.1769 3.4981 1.0524 2.9134 1.1827 3.2798 7.6318 2.0306 1.1993 1.4227 1.3052 1.3501 1.7516 1.5052 1.4557 1.3342 1.4020 8.6757 1.2149 1.2214 1.2859 2.8612 2.9063 1.4665 1.5675 1.2045 1.1822 1.0747 1.0614 1.0827 1.0572 1.3324 1.1098 1.2255 1.3935 5.0732 5.5977 6.6797 6.1158 1.0593 1.0362 1.0390 1.0410 1.0592 1.0675 1.0653 1.0998 1.0953 1.0951 1.0970 1.0997 1.0994 1.0982 1.0998 1.0995 1.0995 1.0855 1.0900 1.0947 1.0958 1.0987
irintensity: 3.2342 0.9867 0.1479 0.8174 1.2443 1.0230 0.6042 3.0195 0.2481 0.9466 4.3484 0.2119 0.3949 0.1760 1.7548 2.1252 0.6518 2.3474 3.4099 1.5939 0.0716 8.3139 3.2344 2.3401 0.4222 14.4878 0.6872 11.2109 4.9157 2.1626 0.0339 8.3386 3.2172 5.1517 33.8674 2.3345 22.5637 14.2101 6.1892 21.5990 73.7196 0.2053 7.2065 1.0705 12.3523 13.0360 30.7532 10.8695 8.4311 9.7332 1.4891 0.0906 0.3562 29.8303 12.0215 3.4508 15.8388 5.3516 90.9721 15.0651 23.2459 9.0071 1.7097 33.2055 0.1599 10.4987 0.1514 1.5461 12.5744 67.4375 1.6272 21.1784 1.2602 1.1765 10.7252 3.1960 19.4410 8.7709 3.4051 0.4616 12.8451 9.8212 61.6411 29.4493 134.5739 59.6024 45.4517 1.7404 20.9436 9.4663 14.3433 22.0512 7.5569 73.9259 39.4510 27.5789 38.1377 18.3432 220.5194 6.3727 25.4223 25.1600 45.2849 27.0823 24.7081 22.3275 43.7451 80.7070 33.6683 1.6399 15.1898 47.1098 64.7277 38.7629 6.7719 45.2176 30.5060 3.5595 0.2997 11.7266 31.2350 8.6916 3.2028
temp: 298.150 k
press: 1.00000 atm
elementType: 8 7 7 7 7 6 6 6 6 6 6 6 6 6 6 6 6 6 6 6 6 1 1 1 1 1 1 1 1 1 1 1 1 1 1 1 1 1 1 1 1 1 1
symmnumber: 1
zpe: 936932.0 jmol-1
zpe.correction: 0.356859 hartree
zpe.thermalcorrener: 0.378191 hartree
zpe.thermalcorrenthalpy: 0.379135 hartree
zpe.thermalcorrgfe: 0.304465 hartree
zpe.sumelectzpe: -915.544807 hartree
zpe.sumelectthermal: -915.523474 hartree
zpe.sumelectthermalent: -915.522530 hartree
zpe.sumelectthermalfe: -915.597200 hartree
dipole: 1.9179 -0.7446 1.1557
dipole: 2.3597
quadrupole: -95.8037 -127.8709 -129.4488
quadrupole: -7.2634 -2.3640 -7.1480
quadrupole: 21.9041 -10.1631 -11.7410 -7.2634 -2.3640 -7.1480
hfenergy: -915.9016652 hartree
pointgroup: C01 [X(C16H22N4O1)]
dipole: -0.7570876 -0.3193077 -0.4321768 debye
polarizability: 311.5650009|6.2304712|203.5883766|0.0124368|4.3959636|125.2965603 unknown
InChI: InChI=1S/C16H22N4O/c1-4-11-19(12-5-2)16(21)15-13(3)20(18-17-15)14-9-7-6-8-10-14/h6-10H,4-5,11-12H2,1-3H3
charge 0 multiplicity 1
43 atoms
O  1.883823 -1.800563 1.140165
N  2.964522 -0.026085 0.087817
N  -1.727173 0.097432 -0.01889
N  0.179505 1.216783 -0.104231
N  -1.138424 1.38814 -0.234225
C  4.273006 -0.600276 0.497037
C  3.020706 1.237278 -0.687687
C  5.02878 -1.313699 -0.65166
C  3.15077 2.500691 0.194655
C  1.81614 -0.69096 0.495844
C  0.465516 -0.126013 0.189861
C  -0.751968 -0.848061 0.257369
C  4.256073 -2.507576 -1.250536
C  3.250992 3.775999 -0.668457
C  -3.156347 -0.012142 -0.080979
C  -1.012896 -2.283819 0.599897
C  -3.777721 -1.160468 -0.627909
C  -3.936291 1.074985 0.384157
C  -5.186854 -1.227781 -0.683211
C  -5.342255 0.999875 0.31242
C  -5.97382 -0.151799 -0.213646
H  4.071484 -1.319315 1.308294
H  4.896371 0.222194 0.89886
H  2.116245 1.330746 -1.308135
H  3.891977 1.168737 -1.368684
H  5.276956 -0.587771 -1.452051
H  5.99705 -1.660651 -0.23808
H  2.260299 2.560316 0.844894
H  4.04092 2.415008 0.84921
H  3.308702 -2.173492 -1.711063
H  4.853657 -3.014953 -2.03002
H  3.999647 -3.243592 -0.468309
H  2.341726 3.901267 -1.285046
H  3.355161 4.676092 -0.036362
H  4.123488 3.738991 -1.349027
H  -1.093904 -2.911321 -0.308043
H  -0.153137 -2.650325 1.181102
H  -1.946078 -2.400124 1.177805
H  -3.174834 -1.980956 -1.026387
H  -3.433439 1.959431 0.783964
H  -5.666694 -2.116734 -1.106257
H  -5.945132 1.840556 0.671802
H  -7.066446 -0.207044 -0.261854
