program: Gaussian 09
title: 000115990
version: EM64L-G09RevD.01
frameworkgroup: C1[X(C10H9N3O2)]
method: RPBEPBE
basis: SDD
operation: Freq
keyword: #p
keyword: freq=noraman
keyword: PBEPBE/SDD
title: #p freq=noraman PBEPBE/SDD
converged: YES YES NO NO
title: Mulliken charges:
elementType: O O N N N C C C C C C C C C C H H H H H H H H H
charge: -0.390546 -0.267702 -0.310416 -0.053218 -0.043652 0.313606 0.416727 -0.138499 -0.749656 -0.327636 -0.357734 -0.217885 -0.205798 -0.237373 0.164925 0.296250 0.243082 0.249616 0.246850 0.277602 0.234948 0.237628 0.237227 0.381654
chargesum: 0.00000
title: Mulliken charges with hydrogens summed into heavy atoms:
elementType: O O N N N C C C C C C C C C C
charge: -0.008892 -0.267702 -0.310416 -0.053218 -0.043652 0.313606 0.416727 -0.138499 0.039292 -0.080786 -0.080132 0.017063 0.031830 -0.000146 0.164925
polarizability: 2.18449321e+02 -1.91655893e+00 1.30005718e+02 -2.28550470e+00 -7.46893796e+00 6.61058835e+01
1716.lowfreq: -7.8158 -2.9795 -0.0005 -0.0004 -0.0001 7.3873 45.5009 53.0354 65.0748
frequency: 45.4969 53.0333 65.0648 96.0363 169.6778 178.3296 208.3868 257.4218 267.7614 286.5893 326.2948 391.5659 407.0702 450.6608 497.7476 546.5761 567.8854 610.9158 640.2795 651.9939 662.9571 682.2742 695.6159 713.0991 755.6980 764.4861 842.2077 858.3727 923.2685 946.4321 975.9437 989.2868 998.1597 1014.0593 1016.7131 1038.8221 1050.8563 1089.1868 1144.4521 1175.9560 1188.0010 1189.2685 1242.0658 1264.0979 1321.1682 1362.9515 1385.8825 1407.7700 1419.5417 1445.0006 1453.5928 1479.9836 1497.6267 1539.5590 1597.3285 1609.6747 1629.3613 2989.9710 3071.8424 3119.1021 3137.1033 3148.0320 3162.9658 3174.2605 3182.4804 3518.9218
redmass: 4.8292 6.6080 5.7328 5.5307 4.5503 1.2634 3.2736 4.5430 4.6632 4.5035 4.8229 6.2318 2.8781 9.9275 3.7767 4.9427 1.3578 6.4022 5.4320 4.8750 4.8906 5.4812 2.1434 5.0318 9.1092 1.7068 1.3513 4.1862 1.4245 6.1999 1.3819 6.0706 1.3253 3.3860 2.6122 1.7812 1.5819 1.5468 2.3484 1.0522 2.3095 1.6093 11.9442 2.7853 1.3546 3.9631 9.0348 1.2870 3.6606 1.9027 1.2577 1.4400 1.7944 7.7234 6.6728 6.1359 7.7412 1.0395 1.0952 1.0994 1.0856 1.0898 1.0941 1.0965 1.0990 1.0641
irintensity: 0.2968 1.7415 3.5421 0.3861 1.2921 0.8034 2.8579 0.6248 0.5294 6.9962 1.4517 3.6464 0.0071 5.2900 13.7416 15.3179 95.5968 0.2941 12.9300 38.4698 31.3754 15.2660 38.9196 39.1623 8.8302 67.4264 1.9803 23.6084 5.7757 62.9622 2.1146 0.2614 0.6719 1.6933 314.2582 20.2022 4.8587 13.0953 86.5237 0.0783 3.6789 0.1310 24.5850 1.0562 0.9046 34.3488 3.3729 22.9095 106.3606 44.4536 22.2872 70.2190 64.1544 75.0394 6.5098 38.7474 259.4503 10.2622 9.1200 0.2814 0.2299 9.8208 26.6024 9.3660 3.5064 53.9056
temp: 298.150 k
press: 1.00000 atm
elementType: 8 8 7 7 7 6 6 6 6 6 6 6 6 6 6 1 1 1 1 1 1 1 1 1
symmnumber: 1
zpe: 464116.3 jmol-1
zpe.correction: 0.176773 hartree
zpe.thermalcorrener: 0.189575 hartree
zpe.thermalcorrenthalpy: 0.190519 hartree
zpe.thermalcorrgfe: 0.136624 hartree
zpe.sumelectzpe: -700.079326 hartree
zpe.sumelectthermal: -700.066524 hartree
zpe.sumelectthermalent: -700.065580 hartree
zpe.sumelectthermalfe: -700.119475 hartree
dipole: -3.7032 3.1767 0.7256
dipole: 4.9327
quadrupole: -71.6686 -91.3280 -87.5326
quadrupole: -0.6058 -0.7474 -6.2469
quadrupole: 11.8411 -7.8183 -4.0229 -0.6058 -0.7474 -6.2469
hfenergy: -700.256099 hartree
pointgroup: C01 [X(C10H9N3O2)]
dipole: -1.4591998 1.2485639 0.2793243 debye
dipolederiv: -1.0851282 0.5288519 0.1019271 0.6683076 -0.6461365 -0.0406635 0.1157632 -0.0394205 -0.4130025 -0.9244099 -0.1868468 -0.0509139 -0.2647664 -0.9129482 -0.131542 -0.0579709 -0.1302142 -0.3661308 -0.8334056 0.1144218 0.0201227 -0.001678 -0.3260262 -0.027539 0.0197791 -0.044046 -0.0146688 -0.0159972 -0.4518918 -0.1091903 -0.4221027 0.1234778 0.0652898 0.0291371 0.0252804 -0.1453407 -0.4261803 0.3230544 0.0790242 0.1780532 0.0439684 0.0378618 -0.0650943 0.0501446 -0.1327319 0.7814005 -0.053919 0.006604 0.1068931 0.2271738 0.0489779 -0.017594 0.0294834 0.0621445 0.9122278 -0.0673847 -0.0066793 -0.0621714 0.044796 -0.0718179 -0.05986 -0.0359914 0.0820379 -0.9473853 0.0165149 -0.0215325 -0.0612131 -0.2333843 -0.0617704 0.0160031 -0.0473245 -0.036356 -0.0430955 0.0077776 -0.0116294 0.0085232 -0.1543444 -0.0513968 -0.0550375 -0.0281063 0.065299 -0.1476264 0.0574508 -0.0285442 0.0317322 -0.0625479 -0.0413614 -0.0396106 -0.0481209 -0.1136828 -0.175398 -0.0617024 0.0109764 -0.0660201 -0.0049257 -0.0481096 0.0158149 -0.019323 -0.1099152 -0.0422982 -0.0718283 0.0127165 -0.1036969 0.0627868 -0.0988054 0.0522344 -0.0886005 -0.1001532 0.0240496 0.0946392 -0.0525166 0.1066331 0.0499652 -0.0928066 -0.082525 -0.0874283 -0.0948066 0.0570829 -0.0272412 -0.0129672 -0.0034303 -0.0792773 -0.0244006 -0.015392 -0.0305221 -0.1382138 2.316422 -0.1507977 0.0080134 0.0014891 1.2943467 0.2203183 0.0728788 0.2127486 0.3153359 0.0558079 -0.0710265 -0.0729103 -0.0018324 0.1156226 -0.0064476 -0.0449512 -0.0282216 0.0980744 0.1243312 0.0534435 -0.0309091 0.0335151 0.0133813 0.0431241 -0.0306227 0.0812593 -0.0365759 0.0121312 0.0543609 0.1114947 0.0223873 0.0669685 0.0040665 0.1110447 -0.0193489 0.046916 0.0465397 -0.077809 0.0587139 -0.0697429 0.027074 0.0647151 0.0735731 0.0608694 0.1183456 0.1020872 0.0626948 -0.0208605 0.0601512 0.0490847 0.059982 -0.0319745 0.0409335 0.1397737 0.0352494 0.0586154 -0.020209 0.0867075 -0.0312839 0.0859039 -0.0291311 0.0835732 0.1188553 0.0043198 -0.0714304 0.0436269 -0.087929 0.0020352 0.0774793 0.0537094 0.0753903 0.1176497 -0.1183738 0.0240824 0.0107096 0.0292351 0.1024076 0.0269266 0.0137915 0.0224465 0.1522253 0.287649 -0.1040296 -0.0250672 -0.1890445 0.2277856 -0.0379844 -0.0439657 -0.0354609 0.3849208 unknown
polarizability: 218.4718698|-1.8235826|130.0256456|-1.449697|-7.3854452|66.0634073 unknown
InChI: InChI=1S/C10H9N3O2/c1-7-9(10(14)15)11-12-13(7)8-5-3-2-4-6-8/h2-6,14H,1H3
charge 0 multiplicity 1
24 atoms
O  4.397505 -0.811337 -0.128642
O  3.832394 1.396951 0.318611
N  -0.121409 -0.301852 -0.107372
N  0.377238 -1.643158 -0.359026
N  1.703126 -1.559696 -0.324662
C  0.928399 0.573698 0.081721
C  -1.540526 -0.101004 -0.064898
C  2.082492 -0.235458 -0.060903
C  0.808878 2.028037 0.420855
C  -2.126094 1.081752 -0.577353
C  -2.34992 -1.132328 0.471267
C  -3.527826 1.240785 -0.524858
C  -3.749431 -0.965612 0.506873
C  -4.343471 0.221751 0.01765
C  3.473488 0.214886 0.063163
H  1.732964 2.355722 0.920688
H  0.701137 2.647679 -0.489125
H  -0.0628 2.221459 1.069369
H  -1.505326 1.857302 -1.034989
H  -1.876863 -2.045999 0.840872
H  -3.98109 2.155366 -0.921551
H  -4.37604 -1.762813 0.920221
H  -5.430665 0.347874 0.052342
H  5.31154 -0.429405 -0.027752
