program: Gaussian 09
title: 000115987
version: EM64L-G09RevD.01
frameworkgroup: C1[X(C14H19N5O)]
method: RPBEPBE
basis: SDD
operation: Freq
keyword: #p
keyword: freq=noraman
keyword: PBEPBE/SDD
title: #p freq=noraman PBEPBE/SDD
converged: YES YES NO NO
title: Mulliken charges:
elementType: O N N N N N C C C C C C C C C C C C C C H H H H H H H H H H H H H H H H H H H
charge: -0.317863 -0.133561 -0.312848 -0.116410 -0.082109 -0.693495 0.308954 -0.344232 -0.348207 -0.160006 0.227127 0.429053 -0.749952 -0.668501 -0.665783 -0.316571 -0.362733 -0.419879 -0.405754 0.514639 0.254401 0.205875 0.262282 0.203469 0.235396 0.239673 0.289651 0.205991 0.253468 0.213263 0.201225 0.262475 0.210372 0.245198 0.267775 0.223364 0.223923 0.310446 0.309887
chargesum: 0.00000
title: Mulliken charges with hydrogens summed into heavy atoms:
elementType: O N N N N N C C C C C C C C C C C C C C
charge: -0.317863 -0.133561 -0.312848 -0.116410 -0.082109 -0.073162 0.308954 0.116044 0.117544 -0.160006 0.227127 0.429053 0.014767 0.004221 0.008288 -0.071373 -0.094958 -0.196516 -0.181832 0.514639
polarizability: 3.34510933e+02 5.89027262e+00 1.77753547e+02 -2.05639514e+00 1.59728252e+01 1.15109140e+02
1716.lowfreq: -10.6688 -4.3367 -3.3575 -0.0008 -0.0007 -0.0003 19.0754 29.6639 46.4904
frequency: 18.7517 29.6317 46.4814 57.1591 70.3352 83.5530 94.3639 133.2388 145.9786 152.6919 177.9040 205.0754 215.7103 223.0395 242.4599 263.7713 288.2880 318.0931 326.6064 351.9801 379.7869 380.0103 392.9719 410.6350 411.6950 418.6338 454.9517 496.9418 520.1899 552.4162 618.0338 630.7251 644.6720 646.3738 663.0144 686.7498 720.0267 752.6419 773.0157 777.1074 808.2032 819.2528 825.6943 853.3696 908.1675 937.2702 941.0818 953.6533 958.3088 995.0968 1005.2927 1019.5832 1033.1923 1047.7302 1071.6774 1078.4767 1084.6341 1099.4307 1133.3254 1168.6573 1184.6124 1192.9974 1208.9588 1214.5462 1252.3939 1299.2755 1310.2425 1316.7071 1330.4895 1341.5592 1358.2413 1378.7193 1384.2231 1386.9669 1405.0703 1409.3585 1428.6511 1437.9105 1446.2969 1451.3088 1463.9882 1464.6198 1471.1366 1482.1018 1482.9759 1485.3982 1519.2735 1529.3664 1546.1409 1583.9122 1634.4613 1647.7170 2982.6162 2983.3804 2988.8494 2992.3859 3008.6227 3067.7918 3067.9698 3070.3646 3084.2466 3094.7445 3103.2733 3107.4068 3123.1173 3129.2815 3132.2195 3167.1026 3175.3187 3565.8316 3705.2707
redmass: 3.8760 4.3455 3.8442 3.8623 4.3922 3.5312 3.0651 3.8129 1.3907 3.7356 1.8008 1.1637 2.6721 1.6136 3.4209 4.2303 3.3400 3.0784 2.8226 3.4012 1.3889 1.1213 2.6919 3.4143 2.9271 4.6163 3.8459 3.7848 2.7166 3.9177 5.0277 6.4277 5.6674 5.7802 7.9895 5.7181 3.6079 6.9837 1.2619 1.2332 1.2772 3.9405 2.0154 2.4510 4.7904 1.3780 2.1612 1.3774 4.8075 3.1651 2.5442 1.4884 2.0498 1.5333 2.1176 2.0824 2.1697 1.8061 1.2110 3.1456 1.5668 2.0747 4.5712 5.0762 1.9169 1.2840 1.5899 1.8439 2.6298 1.2420 1.3901 1.2194 1.2195 5.1600 1.2810 3.4095 2.0494 1.3928 1.9423 1.4929 1.0857 1.0850 1.1825 1.1748 1.0677 1.0641 3.5492 4.4095 5.4743 7.3156 2.4249 1.6550 1.0372 1.0357 1.0394 1.0669 1.0622 1.0964 1.0996 1.0987 1.0991 1.0940 1.1019 1.1013 1.0979 1.0896 1.0895 1.0948 1.0955 1.0450 1.1040
irintensity: 3.8954 1.6133 1.6654 1.4875 0.8085 1.5806 1.4818 0.4590 2.3127 2.5101 2.0322 0.2080 1.1738 1.4024 7.8045 0.7356 0.4270 1.1714 2.6929 8.5209 166.8794 34.1743 118.1021 15.1296 0.3108 4.2924 1.3099 12.2473 8.6103 5.3802 2.4265 1.4870 20.7940 8.4956 0.7781 2.8427 0.0166 4.9118 4.4595 18.0232 3.4137 14.0629 72.1838 66.4035 20.8988 0.3092 8.1093 1.8975 10.1093 1.4668 2.1641 0.5006 9.5678 8.3522 21.0570 0.3754 93.0849 18.1815 21.2319 2.6705 55.5614 6.3312 9.3249 14.5613 87.3594 7.8261 0.2485 23.3005 93.6076 3.4794 6.2238 19.6347 32.5343 4.1208 48.1258 3.0418 68.1912 101.7838 13.3604 39.9353 7.8575 13.7471 43.8149 28.5035 7.7817 16.0983 221.9883 88.5728 186.4226 2.3400 12.2233 359.2195 32.4843 34.8638 16.8496 56.7406 52.7483 16.4403 11.3300 26.9454 37.9922 17.5370 20.5945 34.4403 1.5443 12.3169 31.7705 7.9578 0.5686 116.3850 23.1253
temp: 298.150 k
press: 1.00000 atm
elementType: 8 7 7 7 7 7 6 6 6 6 6 6 6 6 6 6 6 6 6 6 1 1 1 1 1 1 1 1 1 1 1 1 1 1 1 1 1 1 1
symmnumber: 1
zpe: 832105.8 jmol-1
zpe.correction: 0.316932 hartree
zpe.thermalcorrener: 0.337257 hartree
zpe.thermalcorrenthalpy: 0.338201 hartree
zpe.thermalcorrgfe: 0.266798 hartree
zpe.sumelectzpe: -892.377989 hartree
zpe.sumelectthermal: -892.357665 hartree
zpe.sumelectthermalent: -892.356721 hartree
zpe.sumelectthermalfe: -892.428123 hartree
dipole: -5.1327 -0.5615 1.3780
dipole: 5.3440
quadrupole: -65.5191 -123.5752 -119.6481
quadrupole: 9.3926 0.9266 5.5764
quadrupole: 37.3950 -20.6611 -16.7339 9.3926 0.9266 5.5764
hfenergy: -892.6949217 hartree
pointgroup: C01 [X(C14H19N5O1)]
dipole: 2.032607 -0.39277 -0.3670697 debye
polarizability: 333.5739006|-9.2005864|167.9984528|10.0244764|-28.6430126|125.8012656 unknown
InChI: InChI=1S/C14H19N5O/c1-4-18(5-2)14(20)13-10(3)19(17-16-13)12-8-6-11(15)7-9-12/h6-9H,4-5,15H2,1-3H3
charge 0 multiplicity 1
39 atoms
O  -2.736133 -1.8104 0.363521
N  -3.707233 0.096382 -0.539128
N  0.978515 0.125741 -0.238094
N  -0.895737 1.282935 -0.4717
N  0.434316 1.432854 -0.466891
N  6.631863 -0.353289 -0.131606
C  -0.032465 -0.81059 -0.103848
C  -5.03605 -0.529604 -0.318944
C  -3.708859 1.41315 -1.224158
C  -1.226865 -0.062052 -0.252646
C  -2.599006 -0.630616 -0.130707
C  2.40367 -0.025069 -0.205863
C  0.183248 -2.28126 0.082842
C  -5.467882 -1.427502 -1.49852
C  -3.921743 2.597075 -0.257951
C  3.035038 -0.886898 0.723049
C  3.195161 0.744337 -1.093885
C  4.436112 -1.002192 0.745507
C  4.594726 0.638924 -1.067491
C  5.243346 -0.242229 -0.151238
H  -4.977909 -1.135518 0.600676
H  -5.767391 0.284622 -0.160359
H  -2.754849 1.551055 -1.754206
H  -4.519548 1.384009 -1.978674
H  1.097992 -2.622197 -0.433151
H  0.269415 -2.544035 1.153704
H  -0.699589 -2.820183 -0.291041
H  -5.497815 -0.861305 -2.447862
H  -4.761064 -2.266823 -1.609385
H  -6.47618 -1.842975 -1.315746
H  -4.840686 2.472087 0.344213
H  -3.056007 2.685806 0.418533
H  -4.011082 3.540011 -0.828806
H  2.437697 -1.452526 1.444259
H  2.70105 1.426614 -1.791205
H  4.911586 -1.672724 1.470978
H  5.195779 1.239408 -1.760478
H  7.207515 0.199678 -0.75973
H  7.097162 -0.9764 0.52173
