program: Gaussian 09
title: 000115980
version: EM64L-G09RevD.01
frameworkgroup: C1[X(C6H14ClNO2)]
method: RPBEPBE
basis: SDD
operation: Freq
keyword: #p
keyword: freq=noraman
keyword: PBEPBE/SDD
title: #p freq=noraman PBEPBE/SDD
converged: YES YES NO NO
title: Mulliken charges:
elementType: Cl O O N C C C C C C H H H H H H H H H H H H H H
charge: -0.182318 -0.345762 -0.441114 -0.213009 -0.374379 -0.347916 -0.338421 -0.250968 -0.338547 -0.673970 0.231065 0.256657 0.229621 0.227869 0.220739 0.210172 0.284720 0.226866 0.223309 0.231393 0.222820 0.221044 0.376736 0.343395
chargesum: 0.00000
title: Mulliken charges with hydrogens summed into heavy atoms:
elementType: Cl O O N C C C C C C
charge: -0.182318 0.030973 -0.097719 -0.213009 0.113342 0.109574 0.092489 0.033752 0.111628 0.001287
polarizability: 1.00537991e+02 -8.06427679e+00 9.46841411e+01 3.59522807e+00 -2.98747717e+00 7.34983397e+01
1716.lowfreq: -20.3746 -9.0472 -7.8470 -0.0004 0.0017 0.0029 45.5804 56.5388 79.1878
frequency: 45.5683 56.4943 79.1478 100.7525 135.5864 142.9702 205.5542 217.2955 259.0865 287.3287 312.5804 337.6555 376.9261 412.0492 460.7751 463.2035 510.8172 667.1758 783.7762 805.6575 818.4000 889.7780 926.7095 964.5905 971.7131 998.4449 1027.8445 1051.3405 1073.6946 1093.0846 1100.8804 1126.9323 1152.8685 1196.6450 1211.4394 1234.7128 1261.6616 1285.6443 1308.5271 1324.4084 1325.6321 1356.9191 1369.1773 1390.1667 1395.2589 1427.8043 1451.5862 1459.8862 1471.9314 1476.2326 1481.8710 1491.6864 2782.8878 2920.4223 2976.0188 2988.8451 2995.5454 2999.1925 3030.2755 3045.7749 3067.0292 3085.8918 3091.7681 3094.0089 3147.8177 3567.5063
redmass: 6.1565 4.7646 3.0826 2.9549 3.2235 1.8940 4.4915 3.8953 1.2319 2.5615 9.5434 1.1420 3.4422 2.7829 2.4397 3.0069 4.4506 3.5965 1.1578 1.1492 3.9962 2.2554 2.1120 2.9965 1.4582 1.7542 2.6214 1.9952 3.1195 1.9560 1.7531 1.5832 1.5865 1.7667 1.3090 1.6277 1.5437 1.2402 1.2031 1.1365 1.3885 1.2067 1.3067 1.2688 1.2394 1.2159 1.0767 1.0832 1.0663 1.0555 1.0830 1.0710 1.0574 1.0682 1.0610 1.0360 1.0640 1.0596 1.0926 1.1018 1.1045 1.0996 1.1012 1.1013 1.0925 1.0664
irintensity: 5.0048 0.5260 2.0052 5.9612 0.9413 3.7244 2.1217 9.4817 0.1518 1.7184 13.7499 149.7117 1.0124 39.8967 11.3201 1.6909 75.4861 2.6730 14.7234 9.8279 21.0670 11.4910 15.0609 136.7417 49.7019 49.3867 30.1828 30.7520 12.9460 35.0995 116.8740 27.3705 32.3327 21.0448 24.7597 7.0928 67.4414 18.0948 6.6359 7.2034 2.1636 15.7660 11.9845 8.7019 24.2533 102.0450 9.6339 10.0265 2.9205 28.3131 29.3450 14.2861 465.3638 53.7556 11.6272 17.3956 46.5246 33.6034 19.3241 9.2268 15.1220 50.3921 36.6582 23.5325 9.4938 7.8100
temp: 298.150 k
press: 1.00000 atm
elementType: 17 8 8 7 6 6 6 6 6 6 1 1 1 1 1 1 1 1 1 1 1 1 1 1
symmnumber: 1
zpe: 529771.4 jmol-1
zpe.correction: 0.201779 hartree
zpe.thermalcorrener: 0.214186 hartree
zpe.thermalcorrenthalpy: 0.215130 hartree
zpe.thermalcorrgfe: 0.162418 hartree
zpe.sumelectzpe: -901.423542 hartree
zpe.sumelectthermal: -901.411135 hartree
zpe.sumelectthermalent: -901.410191 hartree
zpe.sumelectthermalfe: -901.462903 hartree
dipole: 2.7179 -3.1017 -2.6255
dipole: 4.8888
quadrupole: -74.4624 -70.0500 -71.4649
quadrupole: -5.2416 2.9367 1.7786
quadrupole: -2.4700 1.9424 0.5275 -5.2416 2.9367 1.7786
hfenergy: -901.6253208 hartree
pointgroup: C01 [X(C6H14Cl1N1O2)]
dipole: -0.1028031 1.5273819 1.1644885 debye
dipolederiv: -0.3872699 0.1888557 -0.0498664 0.0480159 -0.955025 0.133563 -0.0043378 0.0601569 -0.3084297 -0.6234781 -0.2502699 -0.0681895 -0.1126703 -0.811107 0.0439068 -0.0486476 0.4337593 -0.795964 -0.6038687 0.3482046 -0.0016285 0.3821473 -0.4861804 -0.172833 -0.056548 -0.1529814 -0.5270926 -0.7076233 -0.1478644 0.0532264 -0.0721094 -0.6435454 -0.0902213 -0.1490131 -0.1171623 -0.4791703 0.3702948 0.2348871 -0.1302411 0.0785282 0.0142161 -0.113475 -0.0288129 -0.068191 0.1226887 0.3485745 -0.0522262 0.0277775 -0.1590698 0.157423 0.0097325 0.0490541 0.0223609 0.0956375 0.1635215 0.12609 0.0748696 0.1692451 0.6654584 0.0858293 0.0916515 0.0544944 0.2918805 0.4218636 -0.2200696 0.0153669 -0.1306237 1.3888473 -0.2145798 -0.0380149 -0.4995383 0.6347614 0.4765434 -0.2013267 -0.0202946 -0.2315876 0.4588226 0.0312032 0.0153543 0.0037823 0.2810705 -0.0045947 -0.0996261 0.0555292 -0.0812193 -0.0425865 0.0528091 0.0710363 0.0493523 0.0009436 -0.02304 0.0276659 0.02085 0.1055676 -0.0843541 -0.0821917 0.0190813 -0.0451628 0.0803627 0.0265936 -0.0094763 -0.0630247 -0.0376715 0.020813 0.1146999 0.014432 0.0747047 -0.0704274 0.0684623 -0.0197039 0.0692222 0.0392473 -0.0587734 0.0958235 0.0412267 0.0670942 0.0014383 -0.0868029 -0.0624522 -0.0675872 -0.0880497 0.0042561 -0.1000253 -0.0564072 -0.087995 0.0067701 -0.1350317 0.0944302 0.0144993 0.0559349 -0.0026209 -0.0018692 -0.008308 0.0004587 0.0698308 0.0239803 -0.0851743 -0.08131 -0.0380723 -0.0592615 -0.0054702 -0.0729011 -0.1116686 -0.2028207 -0.0790205 0.0074144 0.0436035 0.0226723 -0.060517 0.0172384 0.0181768 -0.0296234 0.0785811 0.0281119 -0.0295795 0.0451394 -0.0155816 -0.0522864 0.1065277 0.016069 0.1013974 0.0051815 -0.0874697 -0.0072285 -0.1080733 -0.0202024 -0.010834 -0.0566578 -0.0816251 -0.0365018 0.0105069 -0.0958138 0.0892317 0.0054978 0.1220143 0.0791448 0.0059783 -0.0196866 0.0323487 0.0622039 0.0466871 -0.0176519 -0.0794557 -0.0177824 0.1122018 -0.0670598 -0.0424863 -0.0167529 -0.1190677 0.0901515 -0.0208107 0.0125328 -0.0507175 -0.1803568 -0.0186547 0.0118081 -0.0521769 0.089422 0.5361136 0.2553121 0.1739825 0.1435125 0.3892715 0.1104604 0.2219133 0.1641695 0.3656934 0.2331153 -0.1486316 0.0575739 -0.1115278 0.156994 0.1152655 0.0369853 0.1536749 0.3059995 unknown
polarizability: 88.7820951|0.7532005|106.5830657|-2.2773196|-2.6483647|73.3553106 unknown
InChI: InChI=1S/C6H14ClNO2/c1-2-8(3-4-9)5-6(7)10/h6,9-10H,2-5H2,1H3
charge 0 multiplicity 1
24 atoms
Cl -1.245126 -2.639236 0.240471
O  -1.766316 -0.253199 -1.189842
O  2.998119 -1.587623 -0.593489
N  0.047521 0.625287 0.401083
C  -1.158474 0.105155 1.106936
C  1.271949 -0.229947 0.552998
C  0.293826 2.086956 0.606845
C  -1.952168 -0.757302 0.084986
C  1.806779 -0.751708 -0.799655
C  1.275447 2.680649 -0.417461
H  -1.802104 0.961076 1.385585
H  -0.928647 -0.471088 2.020029
H  1.023578 -1.102616 1.185468
H  2.074904 0.336285 1.066027
H  -0.679826 2.602645 0.511144
H  0.670814 2.276946 1.638082
H  -3.008537 -0.938703 0.31317
H  2.152028 0.079119 -1.435818
H  1.007564 -1.307686 -1.328814
H  2.280083 2.23016 -0.336863
H  0.908102 2.530466 -1.448477
H  1.383292 3.766389 -0.242829
H  -0.857844 0.245982 -1.084357
H  2.714534 -2.464909 -0.231917
