program: Gaussian 09
title: 000115954
version: EM64L-G09RevD.01
frameworkgroup: C1[X(C18H23N3O2)]
method: RPBEPBE
basis: SDD
operation: Freq
keyword: #p
keyword: freq=noraman
keyword: PBEPBE/SDD
title: #p freq=noraman PBEPBE/SDD
converged: YES YES NO NO
title: Mulliken charges:
elementType: O O N N N C C C C C C C C C C C C C C C C C C H H H H H H H H H H H H H H H H H H H H H H H
charge: -0.305059 -0.300265 -0.092174 -0.162824 -0.024340 -0.365614 -0.355072 -0.390415 -0.378812 -0.495805 0.495425 0.505282 -0.315366 -0.317283 -0.515494 -0.464019 0.228976 -0.333360 0.173641 -0.355636 -0.352576 -0.530314 -0.529915 0.231348 0.195767 0.185843 0.212655 0.209132 0.225120 0.223701 0.203924 0.223025 0.198232 0.287145 0.214578 0.210903 0.236809 0.249531 0.231109 0.231434 0.253987 0.219963 0.230419 0.229697 0.254019 0.222679
chargesum: 0.00000
title: Mulliken charges with hydrogens summed into heavy atoms:
elementType: O O N N N C C C C C C C C C C C C C C C C C C
charge: -0.305059 -0.300265 -0.092174 -0.162824 -0.024340 0.061501 0.043427 0.043836 0.048813 -0.074549 0.495425 0.505282 -0.100788 -0.106380 -0.228349 -0.227210 0.228976 -0.083829 0.173641 -0.124527 -0.121142 0.174054 0.176481
polarizability: 3.15700826e+02 -1.08748696e+00 2.04331133e+02 1.24694903e+01 4.34881461e+00 1.61188547e+02
1716.lowfreq: -13.2872 -8.4078 -4.9841 -2.2717 -0.0007 0.0001 0.0009 14.7552 23.7902
frequency: -10.8473 14.3681 22.9113 42.2033 53.8439 73.3740 105.1376 112.5738 133.0699 143.5466 154.2426 162.9698 176.8384 190.0721 213.0918 227.7994 242.7560 272.6231 282.9981 297.4910 341.1116 350.2908 378.7103 382.2947 396.4684 434.2046 439.2564 466.5893 491.6903 519.5531 526.5877 551.1686 574.8510 614.6409 628.0486 659.7918 705.5411 718.4493 729.3943 732.8997 750.4773 785.0065 802.1324 823.1476 833.0690 842.1300 884.9075 911.9096 922.7114 939.2800 945.0014 946.9675 955.0809 957.8020 960.0697 984.9715 1003.1938 1008.6852 1047.5572 1054.1776 1076.9608 1087.9118 1094.9475 1099.1085 1112.9751 1114.2490 1125.8917 1147.4974 1152.6273 1154.1338 1157.2956 1177.7642 1185.1448 1209.5739 1232.5216 1237.4624 1242.9322 1251.3812 1258.7803 1289.0224 1304.9885 1310.3283 1333.8929 1339.5235 1355.4248 1364.2641 1369.2511 1372.2940 1383.4378 1394.2998 1405.8559 1421.0014 1423.8002 1442.4826 1454.2316 1455.1945 1457.4321 1459.0208 1461.0580 1464.6158 1474.3526 1477.4393 1483.4793 1486.4142 1488.2157 1529.5349 1575.7165 1593.6176 1613.7342 2849.1665 2851.3425 2865.6265 2936.5921 2941.6852 2971.0191 2973.0094 2987.0234 3034.1140 3050.6018 3067.4470 3069.4739 3080.5244 3090.8220 3121.0557 3121.2618 3121.5309 3124.2295 3125.8944 3157.8483 3162.0266 3170.5510 3175.4864
redmass: 3.6399 5.0986 4.7244 3.7574 3.3397 3.8265 3.6262 2.8919 3.9333 3.6792 1.3684 1.1133 2.4472 2.8390 4.1749 2.4139 3.2849 4.8410 3.1649 2.3219 5.4278 4.7466 2.6072 3.2078 2.2577 4.6576 4.0020 2.8178 3.6237 5.1843 2.8122 4.7183 5.2327 3.6288 2.5262 6.8636 5.9835 3.9061 2.9388 4.1551 3.6907 3.3692 1.8177 1.2783 1.4940 1.5634 5.0065 1.5463 3.4805 1.3738 2.3231 4.4061 1.4444 5.2962 1.5854 3.6358 2.5163 1.8763 1.8560 1.7844 2.8995 2.5720 2.4895 1.7693 1.2583 1.2417 1.8584 1.8563 1.3503 2.5539 1.6702 2.0711 1.8333 1.1334 1.4196 1.2688 2.4214 1.4510 1.6687 1.5119 1.4275 3.3162 1.7286 1.4239 1.3075 1.8595 1.7284 1.8585 2.1717 1.9537 1.6753 2.5878 1.1827 1.3596 1.0946 1.0844 1.0560 1.0718 1.1041 1.1052 1.1487 1.0897 2.3547 2.2983 1.0545 6.4249 7.2411 5.6337 6.7378 1.0705 1.0718 1.0694 1.0695 1.0701 1.0311 1.0312 1.0870 1.0889 1.0890 1.1033 1.1037 1.0903 1.0903 1.0879 1.1027 1.1027 1.0912 1.0889 1.0917 1.0950 1.0925 1.0936
irintensity: 0.2308 0.7650 0.0589 0.3318 0.6773 5.1807 3.4828 5.9502 1.3536 4.3917 0.8296 0.0497 3.4368 0.5252 1.3299 1.7046 9.3630 5.2211 20.7974 3.6681 1.9346 0.9869 0.1136 0.2967 3.8795 5.4438 0.3943 0.8421 6.9336 0.8239 24.3152 15.1325 5.8581 5.3055 2.0718 0.5945 12.8929 10.7589 0.9826 9.3190 2.9065 14.0780 71.6666 0.3294 38.7510 0.5996 8.9403 14.6507 71.3759 0.3385 24.5534 47.7364 9.5847 36.5084 4.6706 47.7403 52.7547 5.2925 2.8947 0.4441 3.5238 43.2871 32.3632 0.9637 17.5768 3.8315 26.9124 40.3546 2.2253 12.9764 25.8648 7.9103 15.1286 5.3507 35.7596 10.1959 97.7542 137.1336 40.1009 20.5868 25.9139 6.7840 73.7427 9.1215 1.7620 2.8011 2.6748 0.3485 61.6457 12.1604 10.9822 2.7030 1.8585 16.4921 10.9771 3.7654 15.6205 12.4624 60.5421 26.8367 27.9374 10.6445 106.3950 71.5268 23.0990 29.5299 5.8321 396.2426 4.5218 29.8304 38.9815 188.1081 37.2085 85.8690 87.3946 59.0134 19.9246 43.8154 26.2988 32.9925 23.1416 20.2282 22.5780 31.8277 20.8500 27.9827 21.4547 11.1291 4.2133 6.8984 31.9447 8.7664
temp: 298.150 k
press: 1.00000 atm
elementType: 8 8 7 7 7 6 6 6 6 6 6 6 6 6 6 6 6 6 6 6 6 6 6 1 1 1 1 1 1 1 1 1 1 1 1 1 1 1 1 1 1 1 1 1 1 1
symmnumber: 1
zpe: 999319.3 jmol-1
zpe.correction: 0.380621 hartree
zpe.thermalcorrener: 0.401794 hartree
zpe.thermalcorrenthalpy: 0.402738 hartree
zpe.thermalcorrgfe: 0.328814 hartree
zpe.sumelectzpe: -1012.637860 hartree
zpe.sumelectthermal: -1012.616687 hartree
zpe.sumelectthermalent: -1012.615743 hartree
zpe.sumelectthermalfe: -1012.689667 hartree
dipole: 5.1178 -1.9881 -0.4113
dipole: 5.5058
quadrupole: -174.8064 -125.8607 -136.4905
quadrupole: 15.4232 2.7443 3.7311
quadrupole: -29.0872 19.8585 9.2287 15.4232 2.7443 3.7311
hfenergy: -1013.0184807 hartree
pointgroup: C01 [X(C18H23N3O2)]
dipole: -2.0316437 -0.7481434 0.0697499 debye
polarizability: 315.4137388|-2.6052615|204.8254478|13.8338274|-0.5180717|160.981319 unknown
InChI: InChI=1S/C18H23N3O2/c1-22-17-4-3-15(13-18(17)23-2)14-20-9-11-21(12-10-20)16-5-7-19-8-6-16/h3-8,13H,9-12,14H2,1-2H3
charge 0 multiplicity 1
46 atoms
O  -3.845891 1.647942 1.350039
O  -5.89524 0.906911 -0.610178
N  0.195093 -1.370597 0.168867
N  2.912658 -0.36314 0.064872
N  6.938994 1.176839 -0.058632
C  0.653868 -0.561679 -0.981684
C  1.318661 -2.190643 0.669962
C  1.799841 0.377692 -0.570541
C  2.475417 -1.289901 1.133965
C  -1.01785 -2.168735 -0.129666
C  4.216628 0.155467 0.049696
C  -2.272402 -1.315066 -0.286888
C  4.570769 1.316437 -0.71235
C  5.293477 -0.452647 0.773888
C  -2.494896 -0.20367 0.561837
C  -3.253446 -1.644531 -1.253646
C  -3.676601 0.557097 0.462857
C  -4.454236 -0.905261 -1.339515
C  -4.685473 0.184576 -0.474635
C  5.905216 1.764341 -0.734941
C  6.592965 0.078967 0.682027
C  -3.960831 2.969251 0.689633
C  -6.76762 0.878735 0.587801
H  -0.18961 0.047181 -1.352032
H  1.000436 -1.217852 -1.821011
H  1.697049 -2.896179 -0.113997
H  0.972066 -2.79111 1.531505
H  2.164616 0.878955 -1.481032
H  1.405363 1.154715 0.121086
H  2.145693 -0.712626 2.025838
H  3.313864 -1.936027 1.43503
H  -1.15904 -2.867979 0.719509
H  -0.889029 -2.802303 -1.043976
H  -1.733148 0.085967 1.292495
H  3.829297 1.885308 -1.277721
H  5.144202 -1.334105 1.401792
H  -3.086765 -2.488466 -1.933757
H  -5.231033 -1.159403 -2.067901
H  6.166788 2.652721 -1.322727
H  7.411775 -0.397141 1.235085
H  -4.796842 2.981009 -0.032737
H  -3.014764 3.21738 0.171685
H  -4.141369 3.688474 1.502966
H  -7.629926 1.514904 0.336536
H  -6.237833 1.273262 1.473446
H  -7.107391 -0.155772 0.78475
