program: Gaussian 09
title: 000115953
version: EM64L-G09RevD.01
frameworkgroup: C1[X(C18H23N3O2)]
method: RPBEPBE
basis: SDD
operation: Freq
keyword: #p
keyword: freq=noraman
keyword: PBEPBE/SDD
title: #p freq=noraman PBEPBE/SDD
converged: YES YES NO NO
title: Mulliken charges:
elementType: O O N N N C C C C C C C C C C C C C C C C C C H H H H H H H H H H H H H H H H H H H H H H H
charge: -0.306060 -0.300796 -0.097006 -0.149127 -0.107793 -0.354765 -0.342522 -0.403662 -0.378848 -0.492196 0.247404 0.507228 -0.516089 -0.462954 -0.323552 0.229086 -0.334091 0.172740 -0.180202 -0.346944 -0.220763 -0.530308 -0.529879 0.200133 0.226879 0.209625 0.183442 0.212082 0.272679 0.198160 0.219887 0.198369 0.219706 0.288689 0.235746 0.214413 0.248149 0.228194 0.230994 0.226939 0.221652 0.253122 0.228560 0.228336 0.221540 0.253802
chargesum: 0.00000
title: Mulliken charges with hydrogens summed into heavy atoms:
elementType: O O N N N C C C C C C C C C C C C C C C C C C
charge: -0.306060 -0.300796 -0.097006 -0.149127 -0.107793 0.072247 0.050545 0.081100 0.039199 -0.074120 0.247404 0.507228 -0.227400 -0.227208 -0.109139 0.229086 -0.085942 0.172740 0.047993 -0.115951 0.006177 0.173026 0.173799
polarizability: 3.29105728e+02 -3.03512108e+00 1.90121629e+02 -1.38963954e+00 3.76106940e+00 1.69674556e+02
1716.lowfreq: -11.5971 0.0004 0.0007 0.0011 3.6278 6.4264 15.2107 24.4818 27.6793
frequency: 14.8167 22.9013 27.5293 40.5267 63.8554 73.5664 104.4671 105.5337 135.9024 140.9757 159.1796 162.2498 166.6596 187.3600 220.6913 239.7885 256.4869 271.0819 283.1236 307.7159 346.0025 353.4973 384.4123 402.0702 410.2967 436.6848 461.2747 473.9204 491.8402 508.9802 526.6569 551.9418 574.7335 607.0051 618.7166 626.8288 705.8280 726.6243 728.5355 731.4552 750.1155 766.9528 774.9052 830.3831 839.9800 846.0494 884.3457 911.9831 926.5963 939.3683 942.5117 946.5937 951.4115 954.1903 975.8153 984.4315 1000.4036 1007.5030 1042.0244 1053.8843 1055.7667 1087.8165 1091.7023 1099.0003 1112.7497 1114.3462 1122.9979 1144.5247 1146.3821 1152.1947 1156.9474 1170.0259 1182.1895 1183.7655 1203.9221 1231.4350 1240.8492 1250.3901 1256.1432 1281.5125 1299.2337 1301.3680 1329.2912 1330.5441 1340.1106 1358.2885 1362.1981 1368.1761 1387.3177 1393.2395 1404.1131 1423.4301 1425.7569 1442.6270 1454.0597 1455.0738 1457.8811 1459.6516 1462.4589 1464.7793 1474.5299 1477.5735 1483.1933 1487.6617 1488.4574 1551.2597 1576.3798 1598.4615 1613.8926 2846.4640 2856.0368 2869.8589 2949.2538 2954.6242 2970.1855 2971.9210 2983.8622 3026.4122 3046.7643 3066.7261 3068.2278 3092.1654 3097.9494 3117.5466 3119.5265 3119.6715 3124.8970 3133.4797 3157.1243 3161.0235 3164.1195 3176.2571
redmass: 4.8590 4.3933 4.4734 4.5680 3.3173 3.5552 2.7310 3.5053 3.9213 3.5477 1.3972 2.4684 1.3871 1.9607 4.4544 4.2931 2.1172 4.7004 2.8407 2.1492 4.6190 5.5434 3.3761 2.1873 3.4107 4.6102 3.0421 3.4609 3.6393 2.8223 5.2372 4.8458 5.2481 3.6331 4.6699 2.6308 5.9536 1.7005 4.4608 4.2543 3.6726 2.5335 3.4287 1.4814 1.5533 1.4062 4.9585 1.5648 3.8093 2.1234 1.4156 6.1608 3.9472 1.4988 1.3209 3.6230 2.4247 1.9518 2.4933 1.9059 1.9452 2.4644 1.8927 2.2457 1.2682 1.2453 1.8605 3.1649 1.8715 1.3083 1.4852 1.1519 1.8242 1.8564 1.1306 1.4782 2.0863 1.7781 1.5080 1.5550 1.5879 1.8163 1.6246 1.6638 1.9384 1.6264 1.3347 2.8017 2.0885 2.0228 1.8471 1.1841 2.1489 1.3686 1.1177 1.0918 1.0551 1.0764 1.1001 1.1578 1.1733 1.0825 2.2775 1.0731 2.7533 5.2386 7.3018 6.0622 6.7917 1.0704 1.0710 1.0693 1.0695 1.0694 1.0309 1.0311 1.0866 1.0892 1.0897 1.1035 1.1037 1.0908 1.0922 1.0894 1.1028 1.1027 1.0889 1.0885 1.0918 1.0949 1.0923 1.1001
irintensity: 0.1041 0.2825 0.5853 0.3011 0.0907 4.7774 7.1598 2.9516 4.7994 0.7056 0.9799 1.8950 0.7279 2.8750 1.9687 9.9960 3.2758 4.5723 10.0575 6.4201 1.6671 1.4405 1.5783 1.2642 3.6278 5.0281 1.3111 5.3229 7.9968 7.4911 4.8897 15.7456 6.7933 2.6071 4.1414 2.5822 15.1078 32.5836 3.0221 8.5746 2.3965 65.6487 1.9844 41.5504 0.1885 0.1672 10.9184 21.7984 14.7267 5.2136 1.1840 57.4146 80.8344 3.6855 0.1778 52.1448 54.4247 25.1045 7.6238 2.8556 7.0996 59.0839 14.5007 6.1066 21.1732 1.3929 20.5900 15.5154 36.3793 0.5011 14.7456 5.4781 11.5410 9.8709 5.3427 47.1012 83.8601 127.8041 61.4683 10.5035 24.1560 33.9219 41.4025 15.9555 51.0447 8.1478 16.5965 5.5072 5.9426 1.7731 16.5732 2.5357 29.6522 16.9320 57.3583 13.4663 14.9615 9.2728 10.7128 69.5429 35.9237 11.0629 101.0684 47.9546 178.5026 45.9461 6.0183 411.2829 5.0466 35.8700 78.9555 136.0368 40.2866 99.1629 93.5469 55.0891 21.7752 53.8251 35.7432 33.6878 22.9680 25.4138 9.6799 31.0789 21.6436 29.0903 11.6405 12.3741 4.7280 7.5410 33.7477 16.5732
temp: 298.150 k
press: 1.00000 atm
elementType: 8 8 7 7 7 6 6 6 6 6 6 6 6 6 6 6 6 6 6 6 6 6 6 1 1 1 1 1 1 1 1 1 1 1 1 1 1 1 1 1 1 1 1 1 1 1
symmnumber: 1
zpe: 998947.2 jmol-1
zpe.correction: 0.380479 hartree
zpe.thermalcorrener: 0.402460 hartree
zpe.thermalcorrenthalpy: 0.403404 hartree
zpe.thermalcorrgfe: 0.326922 hartree
zpe.sumelectzpe: -1012.645677 hartree
zpe.sumelectthermal: -1012.623696 hartree
zpe.sumelectthermalent: -1012.622752 hartree
zpe.sumelectthermalfe: -1012.699234 hartree
dipole: -0.3512 -1.5910 -1.3063
dipole: 2.0884
quadrupole: -124.4575 -127.8829 -137.8667
quadrupole: -6.8689 -3.1135 1.4671
quadrupole: 5.6115 2.1861 -7.7977 -6.8689 -3.1135 1.4671
hfenergy: -1013.0261558 hartree
pointgroup: C01 [X(C18H23N3O2)]
dipole: 0.1594117 -0.6585934 0.4646608 debye
polarizability: 328.7046852|8.1483413|190.9892367|-0.1370836|-2.1230932|169.2079916 unknown
InChI: InChI=1S/C18H23N3O2/c1-22-16-7-6-15(13-17(16)23-2)14-20-9-11-21(12-10-20)18-5-3-4-8-19-18/h3-8,13H,9-12,14H2,1-2H3
charge 0 multiplicity 1
46 atoms
O  3.949998 1.569618 1.365846
O  5.915535 0.828851 -0.673516
N  -0.236088 -1.236799 0.223617
N  -2.913349 -0.179776 0.318378
N  -4.485319 1.057764 -0.921725
C  -0.725194 -0.324062 -0.841945
C  -1.349529 -2.049639 0.761978
C  -1.8193 0.604917 -0.292607
C  -2.457197 -1.139471 1.335384
C  0.921223 -2.056407 -0.201663
C  -4.250891 0.121262 0.061704
C  2.207143 -1.248522 -0.354939
C  2.497742 -0.185885 0.534187
C  3.149465 -1.577303 -1.359633
C  -5.341138 -0.497358 0.761406
C  3.709778 0.525898 0.438314
C  4.379624 -0.887884 -1.444205
C  4.678428 0.152059 -0.539525
C  -6.657634 -0.151781 0.411072
C  -5.769821 1.373533 -1.234914
C  -6.898333 0.800312 -0.611407
C  4.093921 2.91244 0.756334
C  6.814334 0.699728 0.497684
H  -1.131355 -0.901261 -1.710773
H  0.123069 0.284398 -1.20277
H  -0.961062 -2.695914 1.571807
H  -1.800943 -2.710446 -0.022437
H  -1.370895 1.271696 0.474674
H  -2.257491 1.223073 -1.090456
H  -3.291632 -1.772168 1.67469
H  -2.05101 -0.596423 2.215881
H  0.719813 -2.606801 -1.156037
H  1.074284 -2.83007 0.578561
H  1.763764 0.10196 1.293409
H  2.928594 -2.381396 -2.071875
H  -5.172248 -1.217766 1.565478
H  5.126321 -1.142141 -2.203465
H  -7.495404 -0.619245 0.940905
H  -5.887399 2.125008 -2.02556
H  -7.910923 1.090684 -0.904191
H  3.143786 3.213853 0.275527
H  4.910598 2.924619 0.012098
H  4.321479 3.591174 1.592506
H  7.699467 1.308043 0.25648
H  7.109858 -0.358048 0.633692
H  6.324429 1.072376 1.415232
