program: Gaussian 09
title: 000115947
version: EM64L-G09RevD.01
frameworkgroup: C1[X(C20H26N2O3)]
method: RPBEPBE
basis: SDD
operation: Freq
keyword: #p
keyword: freq=noraman
keyword: PBEPBE/SDD
title: #p freq=noraman PBEPBE/SDD
converged: YES YES NO NO
title: Mulliken charges:
elementType: O O O N N C C C C C C C C C C C C C C C C C C C C H H H H H H H H H H H H H H H H H H H H H H H H H H
charge: -0.305835 -0.271276 -0.300711 -0.092611 -0.175202 -0.372706 -0.352462 -0.410568 -0.386890 -0.495306 0.470350 0.507910 -0.352385 -0.389222 -0.513088 -0.466035 -0.376100 -0.358899 0.228334 -0.333842 0.317674 0.173064 -0.530092 -0.537406 -0.530079 0.225851 0.194138 0.183692 0.205814 0.217442 0.206789 0.213452 0.203459 0.220419 0.195863 0.239065 0.216919 0.288092 0.236312 0.243332 0.234386 0.248152 0.252726 0.220487 0.229031 0.216463 0.216041 0.241159 0.228311 0.254190 0.221797
chargesum: 0.00000
title: Mulliken charges with hydrogens summed into heavy atoms:
elementType: O O O N N C C C C C C C C C C C C C C C C C C C C
charge: -0.305835 -0.271276 -0.300711 -0.092611 -0.175202 0.047282 0.037044 0.013663 0.030022 -0.079024 0.470350 0.507910 -0.113321 -0.172303 -0.224996 -0.229723 -0.132769 -0.124512 0.228334 -0.085690 0.317674 0.173064 0.172152 0.136257 0.174218
polarizability: 3.62960827e+02 -4.76368244e-01 2.29725314e+02 1.44769939e+01 -1.95575023e+00 1.63690205e+02
1716.lowfreq: -11.1454 -4.1805 -0.0012 -0.0008 0.0009 1.5916 12.3492 21.7477 22.8439
frequency: 11.5397 21.7353 22.8147 44.4645 62.6213 66.3683 79.5224 98.0180 107.1156 114.4523 138.1428 152.6049 162.6470 171.8633 178.8564 197.3185 209.8401 233.4001 243.2525 260.8208 271.9633 279.8529 306.7478 318.9742 347.6744 371.4435 386.5421 395.4348 411.7954 417.3915 428.7809 463.6479 472.6523 491.6781 517.6838 526.0381 548.9198 568.3098 599.2607 624.3718 634.7402 679.7663 705.2091 715.6376 731.9937 750.3907 771.8020 781.5380 795.3183 812.6259 832.3885 851.3101 884.6374 910.5902 914.5190 921.1195 936.2361 944.6865 947.0919 954.1635 985.1240 986.5013 1000.0405 1008.2726 1009.8674 1055.8574 1062.5130 1087.8941 1096.1651 1112.6638 1112.8779 1114.6145 1118.7239 1125.7100 1145.9727 1150.8151 1153.4049 1156.5520 1158.5934 1176.5208 1183.3546 1185.0672 1206.8357 1226.9333 1231.9531 1239.7222 1242.3353 1256.2946 1287.7343 1301.7333 1309.9352 1331.5478 1343.1391 1352.5829 1358.1611 1368.8564 1374.5782 1379.8508 1391.3267 1405.0793 1423.4213 1427.3745 1437.1037 1442.3743 1451.8429 1457.1348 1458.3400 1459.0716 1463.9357 1464.9677 1468.0960 1474.2969 1475.2877 1477.5904 1482.5294 1488.0839 1507.7266 1574.5226 1575.9102 1612.8437 1632.4400 2848.2251 2854.2701 2866.6103 2896.5724 2910.5690 2949.5766 2969.3212 2971.5885 2985.9355 3029.6934 3033.1007 3046.0288 3051.5603 3065.3093 3067.9780 3082.1176 3117.5604 3119.1205 3119.5989 3125.3475 3136.8999 3147.2218 3157.2375 3160.2255 3161.0684 3169.4547
redmass: 4.6982 3.7277 4.4177 4.5761 3.7093 2.9903 3.8436 3.9722 3.0469 3.2170 3.8891 1.3713 1.3122 1.9333 2.4968 4.7957 3.1102 1.8918 1.9915 2.1493 3.7914 2.5999 2.3587 4.6558 4.3664 3.9423 3.9402 2.4825 3.2418 3.4510 4.4239 3.8140 2.9692 3.6200 3.8798 2.7098 4.9464 4.7272 3.2410 3.5351 6.4037 2.9957 5.8965 3.6224 4.1647 3.6847 4.1340 3.0467 1.4812 1.6828 1.4976 1.5453 4.7598 1.6639 1.4484 2.9437 1.3816 2.0214 5.3517 1.4711 3.6605 5.0207 3.1841 2.0269 2.2876 1.7907 2.1685 2.6370 2.4199 1.2608 1.2551 1.2453 1.4124 1.9015 1.9830 2.7859 1.3140 1.5527 1.3522 2.0327 1.3100 1.8331 1.1287 1.8531 1.7629 1.6065 2.4159 1.8193 1.5091 1.4538 1.3333 1.6207 1.3901 1.9937 1.9830 3.0128 2.0487 1.8674 1.9527 1.7543 1.1841 3.2828 1.2147 1.3585 1.0925 1.0552 1.0905 1.0736 1.1063 1.0505 1.1134 1.1845 1.0791 1.0939 2.1060 1.0566 2.4368 7.1310 7.2394 6.7218 6.4788 1.0703 1.0712 1.0692 1.0693 1.0708 1.0333 1.0310 1.0311 1.0867 1.0893 1.1035 1.0902 1.0891 1.1037 1.1038 1.0891 1.0986 1.1026 1.1027 1.0888 1.0864 1.0870 1.0919 1.0950 1.0949 1.0961
irintensity: 0.0505 1.0762 0.3993 0.1512 2.4329 2.4459 4.0193 6.3138 6.6235 1.7696 2.3698 0.7770 0.8630 5.5382 1.5285 1.2008 4.1907 4.0216 5.2110 0.6955 2.5331 17.7058 5.8993 0.3494 1.0329 3.2199 0.8661 3.4745 4.8556 1.1837 7.9601 1.0139 0.7456 6.0910 7.7900 20.8489 15.4176 3.5301 4.3918 7.1225 0.2298 29.3437 13.4437 1.6276 10.2624 2.7229 16.7481 7.2156 8.9113 75.0191 41.2390 3.4892 6.9483 2.0116 22.9886 47.1652 3.0709 14.5218 49.9825 12.7206 48.4055 21.7613 114.6084 18.5090 7.4529 3.6932 3.9641 49.6253 29.9039 0.2964 19.4155 1.2557 8.2845 26.6462 36.3091 19.6908 0.2175 20.4671 0.4711 22.2905 61.2528 16.7038 3.8300 357.2939 2.1933 29.6905 94.7064 42.5629 21.5290 20.2133 3.9557 52.2184 9.6450 5.4139 18.9212 3.2569 11.8066 38.5699 7.9138 15.1962 2.0998 5.7418 21.9314 17.5019 7.6939 16.9038 9.1770 8.4597 43.3774 12.3454 47.0603 69.6721 43.1240 9.4330 76.6765 27.7745 350.1605 0.3609 5.2331 4.0222 7.6643 36.4604 51.3156 152.9897 74.5625 117.6762 85.8360 84.3121 64.1622 21.2520 49.0392 57.6628 33.3210 26.2428 33.2236 23.8756 25.0458 33.0604 22.8498 27.5300 11.4970 20.3088 14.8651 4.8715 23.0541 7.2388 5.1917
temp: 298.150 k
press: 1.00000 atm
elementType: 8 8 8 7 7 6 6 6 6 6 6 6 6 6 6 6 6 6 6 6 6 6 6 6 6 1 1 1 1 1 1 1 1 1 1 1 1 1 1 1 1 1 1 1 1 1 1 1 1 1 1
symmnumber: 1
zpe: 1111899.7 jmol-1
zpe.correction: 0.423500 hartree
zpe.thermalcorrener: 0.448298 hartree
zpe.thermalcorrenthalpy: 0.449242 hartree
zpe.thermalcorrgfe: 0.366465 hartree
zpe.sumelectzpe: -1110.946603 hartree
zpe.sumelectthermal: -1110.921805 hartree
zpe.sumelectthermalent: -1110.920861 hartree
zpe.sumelectthermalfe: -1111.003638 hartree
dipole: -0.4987 -1.6731 0.8437
dipole: 1.9390
quadrupole: -131.9505 -138.3224 -152.6963
quadrupole: -12.0025 5.4382 -2.2401
quadrupole: 9.0393 2.6673 -11.7066 -12.0025 5.4382 -2.2401
hfenergy: -1111.3701031 hartree
pointgroup: C01 [X(C20H26N2O3)]
dipole: -0.2060001 -0.6817096 0.2735264 debye
polarizability: 362.9738759|-3.8394432|229.645815|13.7206069|3.6445592|163.756655 unknown
InChI: InChI=1S/C20H26N2O3/c1-23-18-7-5-17(6-8-18)22-12-10-21(11-13-22)15-16-4-9-19(24-2)20(14-16)25-3/h4-9,14H,10-13,15H2,1-3H3
charge 0 multiplicity 1
51 atoms
O  -4.400987 1.773631 1.341857
O  7.475017 1.408992 -0.229663
O  -6.530813 1.125008 -0.561363
N  -0.58513 -1.510599 0.137048
N  2.182199 -0.706915 -0.121745
C  -0.116057 -0.769476 -1.056426
C  0.502105 -2.372102 0.65511
C  1.102334 0.10551 -0.715275
C  1.717807 -1.510755 1.03435
C  -1.848972 -2.246515 -0.099172
C  3.506892 -0.181639 -0.107662
C  -3.055388 -1.324405 -0.250651
C  3.799357 1.143916 -0.553604
C  4.606178 -0.982903 0.313248
C  -3.187568 -0.18083 0.573939
C  -4.076953 -1.612644 -1.188052
C  5.119469 1.629316 -0.588177
C  5.930105 -0.495596 0.296685
C  -4.319598 0.651934 0.479709
C  -5.228624 -0.798024 -1.26992
C  6.195382 0.818117 -0.161098
C  -5.369517 0.325369 -0.429099
C  -4.425486 3.081692 0.647603
C  8.60725 0.593574 0.204734
C  -7.3785 1.185487 0.652451
H  -0.934905 -0.123531 -1.420117
H  0.162882 -1.473548 -1.88159
H  0.819984 -3.136512 -0.099207
H  0.139812 -2.903528 1.555224
H  1.469734 0.564322 -1.650015
H  0.778409 0.923675 -0.028492
H  1.429071 -0.843127 1.879607
H  2.529971 -2.166811 1.384917
H  -2.005594 -2.907057 0.777977
H  -1.786683 -2.917292 -0.994076
H  2.99357 1.816422 -0.860507
H  4.438777 -2.016233 0.634343
H  -2.390401 0.077473 1.278121
H  -3.979078 -2.481338 -1.850201
H  5.333466 2.64667 -0.930935
H  6.739371 -1.154483 0.626691
H  -6.035036 -1.01762 -1.977131
H  -5.270091 3.138103 -0.062715
H  -3.471931 3.243391 0.109522
H  -4.53781 3.834253 1.443022
H  8.715367 -0.316956 -0.418018
H  8.512014 0.300421 1.26952
H  9.492318 1.234669 0.076766
H  -8.199943 1.874029 0.40177
H  -6.805011 1.562974 1.518119
H  -7.785064 0.181994 0.881377
