program: Gaussian 09
title: 000115938
version: EM64L-G09RevD.01
frameworkgroup: C1[X(C19H29NO2)]
method: RPBEPBE
basis: SDD
operation: Freq
keyword: #p
keyword: freq=noraman
keyword: PBEPBE/SDD
title: #p freq=noraman PBEPBE/SDD
converged: NO YES NO NO
title: Mulliken charges:
elementType: O O N C C C C C C C C C C C C C C C C C C C H H H H H H H H H H H H H H H H H H H H H H H H H H H H H
charge: -0.232675 -0.254123 -0.075128 -0.346649 -0.366710 -0.399173 -0.392150 -0.397750 -0.353410 -0.534192 0.101049 0.291262 -0.396535 -0.341549 -0.344069 -0.336965 -0.310673 -0.350475 0.348895 -0.368004 -0.382016 -0.692654 0.169189 0.200180 0.214598 0.167314 0.202475 0.190061 0.191415 0.202779 0.212316 0.189216 0.229538 0.196875 0.233056 0.248792 0.214261 0.214010 0.187034 0.186856 0.208949 0.209246 0.245598 0.279241 0.198070 0.198656 0.249089 0.254977 0.209998 0.210102 0.219805
chargesum: 0.00000
title: Mulliken charges with hydrogens summed into heavy atoms:
elementType: O O N C C C C C C C C C C C C C C C C C C C
charge: -0.232675 -0.254123 -0.075128 0.022720 0.015203 -0.006638 0.002044 0.003781 0.073002 -0.052344 0.101049 0.291262 0.031736 0.032342 -0.098472 -0.057724 0.107523 0.046250 0.348895 -0.118914 -0.127039 -0.052750
polarizability: 3.38996268e+02 1.13086390e+01 2.11329262e+02 2.05120327e+00 9.72513644e-01 1.45412029e+02
1716.lowfreq: -12.5565 -0.0016 0.0008 0.0021 3.3825 5.1784 23.6239 26.6471 27.7108
frequency: 23.5441 26.1163 26.5810 32.3391 56.9263 58.6508 68.4973 71.8005 96.9171 117.6521 125.0595 135.3272 157.1362 157.9549 166.0421 213.2142 227.3129 234.3543 234.6665 282.7581 290.3348 304.1653 341.1248 376.8568 393.7384 413.8490 438.3683 442.7364 454.9200 486.5857 489.6803 499.4221 547.9999 570.4604 622.1706 631.4878 726.6055 731.8517 733.4500 773.2227 783.4714 790.3415 803.2353 815.5455 820.0388 853.6484 856.8788 857.1664 859.3178 893.1468 905.5187 950.8007 957.9636 962.4842 971.9815 975.7424 995.9402 996.5800 1006.0461 1019.9597 1028.1712 1049.3025 1069.5180 1072.7012 1078.2618 1093.0917 1107.1588 1117.1575 1120.8343 1128.0676 1146.1962 1150.1142 1153.7438 1169.1138 1179.9424 1203.0655 1211.5115 1234.2399 1243.5644 1255.9519 1259.8841 1262.7221 1264.4273 1283.3911 1287.3526 1294.0429 1294.9470 1301.5991 1308.2259 1322.2606 1330.4338 1341.1665 1345.5182 1350.6234 1358.0967 1366.3629 1372.1344 1384.9694 1395.3431 1395.6248 1431.0039 1437.6072 1451.0780 1459.4126 1460.6959 1466.3914 1467.6563 1467.9512 1468.6366 1475.3220 1479.6586 1479.9410 1483.1330 1489.9467 1499.6086 1553.3498 1589.4678 1619.3456 2815.0596 2827.3537 2881.3363 2951.4937 2957.8359 2966.4050 2972.7466 2973.1830 2974.4417 2984.1875 2985.4027 2996.2160 2998.2453 3010.5543 3021.7092 3023.8116 3027.4610 3027.8488 3034.7145 3044.7775 3051.4962 3054.0422 3063.2265 3071.6435 3074.3331 3143.7794 3150.3792 3167.0348 3171.7223
redmass: 3.6007 3.1013 4.2728 4.0056 3.0399 2.1285 3.2595 4.1005 2.6615 3.5550 2.5699 2.0251 4.3849 2.9698 3.1477 2.9875 5.4689 1.1624 1.7611 5.5000 3.5824 2.2182 3.6577 2.5786 2.4484 2.9670 3.2609 3.0210 3.3024 4.4677 3.0212 4.0181 1.8970 2.1440 6.0196 6.4112 4.1561 1.0754 3.0395 1.1257 3.5030 1.6696 1.6564 2.0220 1.9570 1.4782 1.9502 1.7313 1.2384 1.9684 2.3702 1.3695 1.3664 4.4026 1.1538 4.2381 2.7242 1.4053 2.4220 3.6351 1.9496 2.1572 1.7948 2.4421 2.4917 1.9983 2.1694 1.3580 2.5144 2.5171 1.4402 1.2755 2.4000 1.2555 1.3224 1.4498 1.7332 2.9544 2.0757 1.2994 1.2605 1.2389 1.1732 1.2104 1.0556 1.1205 1.3496 1.4299 1.8229 1.3551 1.2951 1.4339 1.4997 1.4937 1.5693 1.4480 2.6867 1.8661 1.3439 1.3343 4.2105 1.1060 1.0913 1.0891 1.0873 1.0897 1.0691 1.0871 1.0849 1.0921 1.0985 1.0418 1.1070 1.1315 2.1692 7.2243 8.1730 6.3016 1.0716 1.0702 1.0708 1.0552 1.0586 1.0622 1.0571 1.0601 1.0387 1.0616 1.0613 1.0594 1.0989 1.1060 1.0945 1.0872 1.0901 1.1037 1.0936 1.1033 1.0912 1.1035 1.1047 1.1013 1.0992 1.0873 1.0880 1.0952 1.0971
irintensity: 0.0652 1.2904 0.2354 0.5004 0.3263 0.3817 0.2229 0.1698 2.7463 0.7431 0.1938 0.2534 1.3813 3.5326 0.6947 6.5273 4.2872 0.0732 0.8418 0.6944 2.0657 3.1073 7.3573 3.0119 2.6982 0.0098 2.4462 3.1318 1.7583 0.9771 5.9032 4.9381 7.8872 10.2587 23.9739 13.3581 7.1570 11.5884 0.2846 1.9241 0.5239 26.2561 2.0787 15.5903 5.0499 8.1881 29.9087 17.0901 5.1369 19.8055 6.6203 0.5553 19.9621 132.4725 1.1673 27.7771 1.7881 0.2222 2.7274 9.1688 8.7058 8.3410 4.6669 29.8844 1.5823 1.5456 58.1230 15.9629 2.6302 6.7504 0.5152 5.2706 44.9481 5.2924 279.3564 0.5916 48.4600 225.9454 91.5230 13.1688 8.3854 0.0305 6.0405 2.8463 0.0139 0.9023 9.1724 18.5843 161.6466 0.6741 12.2193 1.1183 56.3365 3.0293 3.2302 13.7747 19.7018 5.7275 8.4858 14.8680 51.6546 15.8407 7.7625 6.8686 11.7114 7.1215 0.2058 1.8929 7.7729 18.8236 8.6275 13.4426 4.6479 32.8465 17.0521 213.0680 91.5841 187.8051 50.5718 147.2883 88.3424 18.7199 20.7554 40.4494 59.8569 30.2759 28.0633 31.4784 35.7287 38.3714 3.2789 21.1689 21.0120 65.0089 68.8562 12.8940 28.9785 21.0248 29.9163 104.3754 26.0959 123.6829 52.5565 13.7157 0.1205 13.7304 7.2159
temp: 298.150 k
press: 1.00000 atm
elementType: 8 8 7 6 6 6 6 6 6 6 6 6 6 6 6 6 6 6 6 6 6 6 1 1 1 1 1 1 1 1 1 1 1 1 1 1 1 1 1 1 1 1 1 1 1 1 1 1 1 1 1
symmnumber: 1
zpe: 1162717.4 jmol-1
zpe.correction: 0.442856 hartree
zpe.thermalcorrener: 0.466193 hartree
zpe.thermalcorrenthalpy: 0.467137 hartree
zpe.thermalcorrgfe: 0.386761 hartree
zpe.sumelectzpe: -944.896715 hartree
zpe.sumelectthermal: -944.873378 hartree
zpe.sumelectthermalent: -944.872434 hartree
zpe.sumelectthermalfe: -944.952810 hartree
dipole: -2.9541 -4.1412 -0.3371
dipole: 5.0980
quadrupole: -114.3507 -141.6216 -135.9025
quadrupole: -1.1169 -1.9678 1.4472
quadrupole: 16.2742 -10.9967 -5.2775 -1.1169 -1.9678 1.4472
hfenergy: -945.3395708 hartree
pointgroup: C01 [X(C19H29N1O2)]
dipole: 1.1306738 -1.6566337 0.0089949 debye
polarizability: 338.457697|-13.9357346|211.5161452|3.4098221|4.3500248|145.7637171 unknown
InChI: InChI=1S/C19H29NO2/c1-2-3-7-16-22-18-10-8-17(9-11-18)19(21)12-15-20-13-5-4-6-14-20/h8-11H,2-7,12-16H2,1H3
charge 0 multiplicity 1
51 atoms
O  -2.115635 2.725211 0.384875
O  4.022597 0.848066 0.233598
N  -4.997184 -0.35238 -0.251683
C  -5.139041 -1.348735 0.842092
C  -6.327543 0.136761 -0.704154
C  -5.987257 -2.557442 0.395597
C  -7.208566 -1.02525 -1.204541
C  -7.374949 -2.096851 -0.103934
C  -4.099287 0.773118 0.114355
C  -2.618505 0.353259 0.120703
C  -1.664685 1.543509 0.266824
C  -0.189701 1.289206 0.259405
C  6.174115 -0.244983 0.083804
C  6.96819 -1.564193 -0.057999
C  0.371108 -0.005258 0.103317
C  0.69572 2.397468 0.40739
C  4.662375 -0.475341 0.066491
C  8.497539 -1.338104 -0.057644
C  2.62914 0.916742 0.235873
C  1.766912 -0.201929 0.090363
C  2.083985 2.219819 0.397066
C  9.298705 -2.651733 -0.180166
H  -5.614256 -0.880256 1.74665
H  -4.133005 -1.692663 1.144911
H  -6.165943 0.869539 -1.5167
H  -6.865576 0.671494 0.124432
H  -5.456243 -3.082589 -0.422053
H  -6.089993 -3.266054 1.2402
H  -8.193778 -0.630317 -1.519419
H  -6.727754 -1.479009 -2.092863
H  -7.957554 -2.957746 -0.483363
H  -7.946969 -1.666495 0.744464
H  -4.226765 1.576315 -0.633213
H  -4.367643 1.223353 1.101824
H  -2.408299 -0.367821 0.936097
H  -2.402361 -0.183481 -0.825019
H  6.447411 0.259966 1.030126
H  6.440135 0.44703 -0.738053
H  6.702837 -2.252372 0.771739
H  6.677549 -2.079316 -0.997631
H  4.349142 -1.142464 0.896366
H  4.336409 -0.923428 -0.895111
H  -0.281666 -0.876674 -0.013993
H  0.254839 3.39255 0.526873
H  8.786368 -0.812338 0.874995
H  8.764719 -0.659526 -0.892811
H  2.168799 -1.211474 -0.033281
H  2.772139 3.063105 0.508654
H  9.072269 -3.334847 0.660181
H  9.052557 -3.18242 -1.119374
H  10.387504 -2.461623 -0.176162
