program: Gaussian 09
title: 000115921
version: EM64L-G09RevD.01
frameworkgroup: C1[X(C11H14N4S2)]
method: RPBEPBE
basis: SDD
operation: Freq
keyword: #p
keyword: freq=noraman
keyword: PBEPBE/SDD
title: #p freq=noraman PBEPBE/SDD
converged: NO YES NO NO
title: Mulliken charges:
elementType: S S N N N N C C C C C C C C C C C H H H H H H H H H H H H H H
charge: 0.218019 0.217001 -0.416641 -0.031862 -0.339400 -0.578912 -0.337664 -0.619559 0.278844 0.020729 -0.183739 -0.640598 -0.357197 -0.340380 -0.215629 -0.229346 -0.094324 0.227277 0.227246 0.285234 0.285173 0.314061 0.265222 0.265184 0.232704 0.245012 0.223442 0.224077 0.215021 0.317174 0.323830
chargesum: 0.00000
title: Mulliken charges with hydrogens summed into heavy atoms:
elementType: S S N N N N C C C C C C C C C C C
charge: 0.218019 0.217001 -0.102580 -0.031862 -0.339400 0.062092 0.116860 -0.049153 0.278844 0.020729 -0.183739 -0.110191 -0.124493 -0.095369 0.007813 -0.005269 0.120697
polarizability: 3.24210694e+02 5.54023114e+00 1.86024075e+02 9.36615453e-03 5.96094593e-03 8.02640891e+01
1716.lowfreq: -17.4765 -9.8182 -2.3961 -0.0027 -0.0008 0.0005 3.2405 10.4312 24.8132
frequency: -9.9744 3.0407 24.7776 27.0190 29.2617 75.5764 81.6569 91.9667 114.4476 139.4859 183.9838 188.6164 245.3475 260.3374 298.8787 318.1893 320.6465 344.5562 414.1256 426.2214 436.9389 485.2937 549.5708 559.3210 578.4946 584.7423 613.1619 650.0409 651.8979 675.1461 750.2477 751.1091 760.2697 766.8389 794.4542 822.2867 854.5306 875.6681 930.7453 932.2438 949.8297 973.3077 1008.5174 1014.5411 1035.4294 1058.9833 1061.4317 1095.5912 1106.5586 1150.8006 1162.4773 1206.4170 1226.2482 1236.6316 1258.8153 1261.7027 1271.6791 1279.2615 1284.5135 1337.8951 1338.1362 1339.4856 1413.0966 1417.8481 1445.3361 1454.1969 1460.8971 1477.2617 1481.0418 1589.5218 1595.6122 1629.6614 1631.7784 2991.5522 3030.5523 3035.4153 3045.8367 3049.1294 3107.4835 3128.8831 3130.9877 3143.4916 3159.2145 3172.6178 3551.7439 3599.4334 3711.0192
redmass: 2.9287 3.5849 4.4132 5.7762 2.3423 6.3797 3.2523 2.3692 7.1213 7.8761 5.3319 4.9574 4.4402 5.3606 6.2246 1.1362 4.9967 5.2462 8.8283 2.9751 5.8743 5.4837 1.3643 1.2168 3.8642 8.2477 6.7085 5.8892 6.7084 4.4331 1.3395 1.0790 5.9580 3.5393 5.1795 1.2182 1.4889 6.6042 8.9455 1.3831 1.3965 1.3032 2.0531 1.3173 5.0820 2.2150 2.0719 1.0341 1.7103 1.7920 1.2041 2.8412 1.1910 1.3067 3.1070 2.9917 1.3526 1.8265 1.0876 2.8618 1.3852 1.3775 2.8449 4.0086 1.0937 1.0816 4.3087 2.7588 1.0952 1.5654 6.8621 2.4005 7.5110 1.0590 1.0565 1.0900 1.1033 1.0570 1.1095 1.1092 1.0852 1.0905 1.0959 1.0991 1.0455 1.0813 1.1040
irintensity: 3.1739 2.2182 7.0549 1.0597 12.7011 0.9357 4.6699 0.1703 0.0442 0.2708 4.5167 13.7849 6.3765 7.3835 1.2195 234.2370 1.1837 8.6251 13.5330 10.9217 19.0785 0.1037 117.4567 98.2452 0.1112 6.7152 0.8040 8.6736 17.9749 2.2891 110.3961 11.7637 6.7451 8.4555 1.3172 0.0401 0.0905 2.6841 7.6716 4.2641 25.5237 0.0679 8.1584 2.4879 0.8692 32.3267 3.4477 0.0611 2.8665 20.7015 14.8227 12.4548 1.1980 1.4232 71.9720 43.5162 26.4425 2.6186 0.0622 86.4643 63.5040 13.3959 21.1067 296.5208 11.4813 5.4652 15.4985 27.6351 9.5794 31.2035 1.0490 477.1852 3.9738 9.6403 21.3388 44.5248 10.0256 7.8253 14.4241 17.0861 0.2287 13.2256 28.6088 19.9517 63.3988 49.2609 40.0701
temp: 298.150 k
press: 1.00000 atm
elementType: 16 16 7 7 7 7 6 6 6 6 6 6 6 6 6 6 6 1 1 1 1 1 1 1 1 1 1 1 1 1 1
symmnumber: 1
zpe: 626382.7 jmol-1
zpe.correction: 0.238577 hartree
zpe.thermalcorrener: 0.255998 hartree
zpe.thermalcorrenthalpy: 0.256943 hartree
zpe.thermalcorrgfe: 0.187241 hartree
zpe.sumelectzpe: -1441.425345 hartree
zpe.sumelectthermal: -1441.407923 hartree
zpe.sumelectthermalent: -1441.406979 hartree
zpe.sumelectthermalfe: -1441.476681 hartree
dipole: -2.1103 -0.4601 -0.0021
dipole: 2.1598
quadrupole: -61.9404 -103.8562 -122.0196
quadrupole: -19.4333 0.0181 -0.0004
quadrupole: 33.9984 -7.9174 -26.0809 -19.4333 0.0181 -0.0004
hfenergy: -1441.6639215 hartree
pointgroup: C01 [X(C11H14N4S2)]
dipole: 0.8315131 -0.1750974 0.0008411 debye
polarizability: 324.2828233|-4.5521102|185.9519458|0.0094085|-0.0058939|80.2640891 unknown
InChI: InChI=1S/C11H14N4S2/c12-8-13-17-7-3-6-16-11-14-9-4-1-2-5-10(9)15-11/h1-2,4-5,8,14H,3,6-7,12H2
charge 0 multiplicity 1
31 atoms
S  -0.230243 -2.055284 -0.000181
S  5.255946 -0.954465 0.000116
N  -2.990207 -1.616092 0.000347
N  -1.751866 0.307375 -0.000153
N  6.124271 0.67013 0.000116
N  8.181824 1.796943 0.00105
C  2.466389 -1.281766 -0.00034
C  1.062868 -0.654926 -0.0010
C  -3.927129 -0.565315 0.000391
C  -3.132323 0.632335 0.000071
C  -1.715927 -1.031834 -0.000052
C  3.536725 -0.17421 -0.001182
C  -5.334866 -0.540692 0.000696
C  -3.763234 1.895435 0.00005
C  -5.947103 0.733375 0.000664
C  -5.174682 1.929953 0.000349
C  7.438798 0.625007 0.001146
H  2.59412 -1.923339 0.892697
H  2.594295 -1.924865 -0.892262
H  0.867088 -0.043731 0.893595
H  0.867377 -0.0450 -0.896529
H  -3.191997 -2.614113 0.000529
H  3.474446 0.46263 0.896352
H  3.474802 0.460875 -0.899983
H  -5.936589 -1.455521 0.000954
H  -3.165502 2.81187 -0.000184
H  -7.040488 0.801286 0.000898
H  -5.690153 2.896479 0.000347
H  8.054338 -0.291328 0.002026
H  9.196414 1.774116 0.002128
H  7.695008 2.691469 0.000246
