program: Gaussian 09
title: 000115917
version: EM64L-G09RevD.01
frameworkgroup: C1[X(C22H32N2O2)]
method: RPBEPBE
basis: SDD
operation: Freq
keyword: #p
keyword: freq=noraman
keyword: PBEPBE/SDD
title: #p freq=noraman PBEPBE/SDD
converged: YES YES NO NO
title: Mulliken charges:
elementType: O O N N C C C C C C C C C C C C C C C C C C C C C C H H H H H H H H H H H H H H H H H H H H H H H H H H H H H H H H
charge: -0.268241 -0.268243 -0.572600 -0.572602 -0.368852 -0.368856 -0.406176 -0.406173 -0.313257 -0.313258 0.348576 0.348574 0.494991 0.494993 -0.542473 -0.542472 -0.386729 -0.386729 -0.350034 -0.350033 -0.376567 -0.376565 -0.431593 -0.431598 -0.387369 -0.387370 0.193435 0.194416 0.194417 0.193435 0.215167 0.214252 0.215166 0.214252 0.204137 0.204894 0.204138 0.204893 0.229364 0.195152 0.229363 0.195154 0.246396 0.246396 0.245413 0.245413 0.230575 0.230575 0.232003 0.232002 0.219979 0.198276 0.219979 0.198277 0.261234 0.275636 0.261235 0.275636
chargesum: 0.00000
title: Mulliken charges with hydrogens summed into heavy atoms:
elementType: O O N N C C C C C C C C C C C C C C C C C C C C C C
charge: -0.268241 -0.268243 -0.035730 -0.035731 0.018998 0.018996 0.023242 0.023245 0.095774 0.095774 0.348576 0.348574 0.494991 0.494993 -0.117957 -0.117954 -0.140333 -0.140333 -0.104620 -0.104620 -0.145992 -0.145990 -0.199591 -0.199595 0.030886 0.030885
polarizability: 4.22961254e+02 8.28599901e+00 2.30436756e+02 3.93476025e-04 3.89663804e-03 1.60618141e+02
1716.lowfreq: -0.0015 -0.0004 0.0019 3.0925 3.7220 10.5202 14.9912 17.6012 24.2229
frequency: 10.5196 16.1980 23.9482 25.4680 32.8851 42.6424 47.9740 62.8929 71.3425 81.8338 87.5690 91.2914 94.3079 117.6274 119.2735 131.6710 136.7724 152.3509 154.7765 200.6075 201.9495 215.7637 221.5097 229.3436 269.9495 305.8438 328.6030 337.5664 356.5429 376.7123 383.3891 388.1527 414.3893 414.6184 448.7079 463.6898 505.0982 523.0760 526.5282 571.4762 578.9326 590.6651 593.7017 634.1550 634.5401 721.7820 721.8131 733.0209 762.6820 763.8130 764.9701 793.8173 793.8700 806.5252 813.0205 820.9944 823.7637 827.0951 839.9545 840.2560 892.4117 930.4588 930.7396 951.0888 951.2758 961.5423 961.6707 966.0651 979.6629 987.8922 1003.8499 1003.9292 1019.5702 1020.0927 1022.3825 1036.5665 1077.5110 1087.5880 1092.9170 1092.9223 1108.7776 1108.9727 1113.1285 1129.5095 1129.6807 1140.4495 1157.6978 1178.4219 1178.8542 1212.8285 1213.5261 1220.1210 1221.6846 1223.5507 1231.5866 1232.2318 1232.5577 1266.6924 1280.7807 1285.8853 1285.8985 1287.5020 1292.4136 1298.6152 1306.3663 1306.3860 1310.4337 1310.4733 1335.7847 1362.1698 1373.4320 1375.0731 1379.3713 1379.4991 1387.8949 1388.9634 1416.6756 1416.6931 1466.1289 1466.4604 1470.9612 1471.9142 1471.9279 1477.2190 1484.9808 1490.1591 1491.6952 1491.7294 1502.3390 1502.7607 1583.2196 1583.3338 1623.5522 1623.9139 1637.2458 1637.2501 2879.7054 2879.7093 2940.0829 2940.1078 2955.9621 2963.1266 2972.4257 2972.4459 2992.6293 2993.9807 2994.4968 2996.3857 2996.4449 3019.8608 3023.5051 3023.5093 3056.7332 3056.7377 3057.7483 3063.9378 3118.6217 3118.6241 3121.5584 3121.5990 3156.6298 3156.6402 3162.1415 3162.1523 3457.4280 3457.4325 3585.4221 3585.4276
redmass: 4.8136 4.7175 4.4497 3.4937 4.1752 3.1224 4.4854 3.1327 2.9110 2.1338 4.7897 2.0297 2.3026 3.9982 5.4271 1.7809 4.2587 2.5939 1.9682 3.8808 2.7461 1.3437 1.6779 2.6976 3.2253 3.0372 3.5447 2.6792 3.4238 4.8292 3.2344 5.1395 2.9635 2.9730 3.6291 4.2479 3.5826 2.7867 2.5733 2.9968 2.0487 1.5082 1.9201 6.7413 6.6991 3.6799 3.6778 1.0710 1.1164 4.3959 4.2212 1.1556 1.1540 1.3568 1.6512 2.1951 1.9475 1.2596 2.1810 2.1787 1.2063 1.5775 1.5767 1.5506 1.5414 1.3602 1.3530 7.8955 7.6725 1.1676 2.6540 2.6400 2.4042 1.9591 3.0297 4.2225 2.3711 2.5491 2.5244 2.5327 1.7259 1.6460 3.2935 1.2249 1.2277 1.5197 1.2319 1.2612 1.2448 1.8585 1.8489 1.3916 3.2006 3.4546 1.3458 1.6141 1.4862 1.2493 1.0584 1.1382 1.1381 1.2963 1.0884 1.1287 1.3763 1.3769 1.3505 1.3513 1.3524 1.5582 2.3187 2.5585 1.3799 1.4021 2.2294 2.0221 3.3329 3.3344 1.0817 1.0738 1.0913 1.0964 1.0946 1.1286 1.1623 1.1617 1.0880 1.0877 2.1786 2.2690 7.0641 7.0644 6.4918 6.4931 1.0952 1.0951 1.0712 1.0712 1.0549 1.0550 1.0590 1.0592 1.0652 1.0652 1.0599 1.0644 1.0932 1.1056 1.1059 1.1042 1.0869 1.0869 1.0990 1.0990 1.1054 1.1047 1.0893 1.0893 1.0889 1.0889 1.0941 1.0941 1.0952 1.0952 1.0449 1.0449 1.0976 1.0976
irintensity: 0.0070 0.0018 0.1354 0.0699 2.3412 0.5507 1.1348 1.2334 0.1036 0.3133 0.0889 4.8486 3.9185 0.0507 0.0641 2.2018 0.1640 2.6418 0.0184 2.3097 23.1076 30.3767 29.6366 11.4573 19.9282 0.5804 10.8765 1.4792 17.5189 5.3955 5.4707 2.7410 0.0109 0.1317 0.9911 0.8897 3.7187 12.7288 35.7525 177.0210 48.7425 286.5053 20.4138 0.1421 1.7320 5.4271 0.0510 12.3011 0.2864 4.5848 18.9029 2.6492 3.1672 40.3105 4.1045 20.5271 7.2642 0.5558 5.1427 79.8727 0.0040 0.0820 1.0085 0.1078 1.1225 0.8481 0.4236 0.0003 166.5154 0.1106 16.1042 0.0240 3.3704 0.4232 16.6267 0.0011 0.0001 29.5973 11.3844 32.1154 8.4165 62.0321 0.8110 24.9357 4.7387 0.0133 1.7087 164.7397 0.1227 160.8602 0.4687 12.6277 375.9601 0.4021 7.7900 0.9748 21.3430 0.2355 0.0097 1.1075 6.0768 0.0131 1.2058 0.0012 1.3706 1.2224 2.0056 1.1729 1.8804 0.0012 0.0083 2.2771 2.2912 41.0815 0.0144 61.9503 3.6773 0.0154 4.4413 0.0006 0.0017 7.7040 3.7869 62.6455 0.2927 95.6131 10.2658 1.0046 228.1896 0.2619 21.4509 0.0010 104.9304 0.0114 71.0207 3.7707 166.6436 32.7211 0.3306 63.2389 0.0161 53.2996 51.2211 30.1377 0.3481 60.6347 10.2958 55.0860 1.1254 10.5965 24.5938 29.8698 2.6030 62.0198 0.0342 148.5827 18.6931 14.0511 53.2156 0.0239 31.5605 7.3395 4.9354 4.3280 1.0646 1.0124 0.4025 0.4030
temp: 298.150 k
press: 1.00000 atm
elementType: 8 8 7 7 6 6 6 6 6 6 6 6 6 6 6 6 6 6 6 6 6 6 6 6 6 6 1 1 1 1 1 1 1 1 1 1 1 1 1 1 1 1 1 1 1 1 1 1 1 1 1 1 1 1 1 1 1 1
symmnumber: 1
zpe: 1307248.9 jmol-1
zpe.correction: 0.497905 hartree
zpe.thermalcorrener: 0.526514 hartree
zpe.thermalcorrenthalpy: 0.527459 hartree
zpe.thermalcorrgfe: 0.433082 hartree
zpe.sumelectzpe: -1115.471825 hartree
zpe.sumelectthermal: -1115.443216 hartree
zpe.sumelectthermalent: -1115.442271 hartree
zpe.sumelectthermalfe: -1115.536648 hartree
dipole: 0.0000 -0.0001 1.5059
dipole: 1.5059
quadrupole: -139.3014 -155.9365 -157.9754
quadrupole: -17.2585 -0.0012 0.0001
quadrupole: 11.7697 -4.8654 -6.9043 -17.2585 -0.0012 0.0001
hfenergy: -1115.96973 hartree
pointgroup: C01[X(C22H32N2O2)]
dipole: -0.0000197 0.5924647 -0.0000711 debye
polarizability: 422.7651616|0.0013795|160.6181413|-10.3136763|0.0082722|230.6328478 unknown
InChI: InChI=1S/C22H32N2O2/c23-15-13-19-5-9-21(10-6-19)25-17-3-1-2-4-18-26-22-11-7-20(8-12-22)14-16-24/h5-12H,1-4,13-18,23-24H2
charge 0 multiplicity 1
58 atoms
O  4.273072 -0.165364 0.918756
O  -4.273039 -0.165674 -0.918651
N  11.890958 1.360622 -0.694153
N  -11.891032 1.360522 0.693621
C  0.681958 -0.138771 -0.36309
C  -0.681939 -0.138681 0.363229
C  1.876823 -0.150285 0.616932
C  -1.876798 -0.150456 -0.616798
C  3.221882 -0.129636 -0.112614
C  -3.221866 -0.129632 0.112727
C  5.611925 -0.151782 0.488621
C  -5.611903 -0.151999 -0.48855
C  8.392016 -0.138355 -0.161021
C  -8.392012 -0.138465 0.161019
C  9.872685 -0.080881 -0.500027
C  -9.87269 -0.08095 0.499976
C  6.584381 -0.201086 1.518418
C  -6.584333 -0.20158 -1.518359
C  6.022166 -0.098681 -0.866182
C  -6.022179 -0.098565 0.866229
C  7.95257 -0.193975 1.190451
C  -7.95253 -0.194414 -1.190428
C  7.403332 -0.091949 -1.172496
C  -7.403353 -0.091787 1.172507
C  10.461476 1.345697 -0.329829
C  -10.461541 1.345551 0.329341
H  0.743978 0.754053 -1.019596
H  0.73826 -1.023165 -1.031293
H  -0.738238 -1.022901 1.031661
H  -0.743967 0.754314 1.019503
H  1.833333 -1.05207 1.257478
H  1.823675 0.725711 1.291714
H  -1.833296 -1.052409 -1.257108
H  -1.823649 0.725364 -1.291807
H  3.327865 0.791875 -0.723592
H  3.324495 -1.010407 -0.78162
H  -3.327881 0.792047 0.723445
H  -3.324466 -1.010218 0.781978
H  10.05718 -0.397091 -1.542608
H  10.441687 -0.773993 0.153551
H  -10.057188 -0.396855 1.542649
H  -10.441652 -0.774283 -0.153401
H  6.244735 -0.248668 2.557849
H  -6.24466 -0.249418 -2.557768
H  5.290799 -0.0668 -1.679309
H  -5.290835 -0.066461 1.679367
H  8.695275 -0.24185 1.996771
H  -8.695213 -0.242507 -1.996756
H  7.714518 -0.053038 -2.223884
H  -7.714565 -0.05262 2.223878
H  9.923851 2.034573 -1.008282
H  10.248981 1.691834 0.711263
H  -9.923963 2.034651 1.007604
H  -10.249035 1.691391 -0.711848
H  12.478004 0.759956 -0.106421
H  12.293966 2.294733 -0.811262
H  -12.478043 0.759679 0.106035
H  -12.294078 2.294647 0.81048
